{"text_format":"1","workbook":"xlsx","n_sheets":4,"sheets":["Rptrs","Data","Temp","Help"],"not_rendered":{"charts":0,"images":0,"macros":1,"external_links":0,"defined_names":17,"comments":0,"pivot_tables":0},"unopened":[],"bounds":{"document_bytes":16777216,"sheet_cells":100000,"rows_first":2000,"rows_last":500,"rows_between":2000,"halvings":0,"cell_chars":16384,"cell_head_chars":4096},"cells_cut":0,"cells_raw":0,"read":"whole","date_system":"1900"}

{"sheet":"Rptrs","index":0,"n_rows":656,"n_cols":15,"rows_kept":656,"cut":false,"hidden":false,"merged":[[1,5,5,11],[1,1,1,2]]}
[]
[null,"Copyrite Rocketwaveuk",null,null,null,"AG=Analogue gateway -  AP=Aprs - AV=Analogue voice repeater -  BN=Beacon -  DD=Digital data - DG=Digital gateway -  DM=Dual-Mode repeater -  DV=Digital voice repeater -   M= DMR -    FUSN= ANALOGUE/DIGITAL C4FM Fusion - PN=Packet node - PX=Packet mailbox -  RN=Regen Node -  RL=Repeater link -  SP=Special -  TV=Television repeater"]
[null,"AREA / OUTPUT",{"$f":"IF(B4=\"OUTPUT\",\"Choose OUTPUT\",\"Choose TOWN\")","v":"Choose TOWN"}]
[null,"EASTANGLIA"]
[]
[null,null,"Read Help To UpDate Data"]
[]
[null,"TOWN","REPEATER","OUTPUT","OFFSET","RECEIVE","AREA","CTCSS/DMR","STATUS","TYPE"]
[null,{"$f":"Data!K9","v":"EPSOM"},{"$f":"Data!D9","v":"2E0BJL"},{"$f":"Data!F9","v":430.26249999999999},{"$f":"F9-D9","v":9},{"$f":"Data!G9","v":439.26249999999999},{"$f":"Data!L9","v":"SE"},{"$f":"Data!M9","v":0},{"$f":"IF(Data!Q9=\"NOT OPERATIONAL\",\"X\",IF(Data!Q9=\"OPERATIONAL\",\"W\",\"R\"))","v":"X"},{"$f":"Data!N9","v":"FU "}]
[null,{"$f":"Data!K10","v":"WESTON SUPER MARE"},{"$f":"Data!D10","v":"2E0HOQ"},{"$f":"Data!F10","v":439.55},-9,{"$f":"Data!G10","v":430.55},{"$f":"Data!L10","v":"SW"},{"$f":"Data!M10","v":0},{"$f":"IF(Data!Q10=\"NOT OPERATIONAL\",\"X\",IF(Data!Q10=\"OPERATIONAL\",\"W\",\"R\"))","v":"X"},{"$f":"Data!N10","v":""}]
[null,{"$f":"Data!K11","v":"GOSPORT"},{"$f":"Data!D11","v":"2E0LNX"},{"$f":"Data!F11","v":439.4375},-9,{"$f":"Data!G11","v":430.4375},{"$f":"Data!L11","v":"SW"},{"$f":"Data!M11","v":0},{"$f":"IF(Data!Q11=\"NOT OPERATIONAL\",\"X\",IF(Data!Q11=\"OPERATIONAL\",\"W\",\"R\"))","v":"W"},{"$f":"Data!N11","v":"DM FU "}]
[null,{"$f":"Data!K12","v":"STOKE-ON-TRENT"},{"$f":"Data!D12","v":"2E0PEU"},{"$f":"Data!F12","v":145.57499999999999},-0.59999999999999432,{"$f":"Data!G12","v":144.97499999999999},{"$f":"Data!L12","v":"MID"},{"$f":"Data!M12","v":103.5},{"$f":"IF(Data!Q12=\"NOT OPERATIONAL\",\"X\",IF(Data!Q12=\"OPERATIONAL\",\"W\",\"R\"))","v":"W"},{"$f":"Data!N12","v":"A "}]
[null,{"$f":"Data!K13","v":"ABERDEEN"},{"$f":"Data!D13","v":"2M0FPI"},{"$f":"Data!F13","v":439.15},-9,{"$f":"Data!G13","v":430.15},{"$f":"Data!L13","v":"SCO"},{"$f":"Data!M13","v":0},{"$f":"IF(Data!Q13=\"NOT OPERATIONAL\",\"X\",IF(Data!Q13=\"OPERATIONAL\",\"W\",\"R\"))","v":"W"},{"$f":"Data!N13","v":"DS FU "},null,null,null,"AREA","OUTPUT"]
[null,{"$f":"Data!K14","v":"ARISAIG"},{"$f":"Data!D14","v":"2M0SBP"},{"$f":"Data!F14","v":439.7},-9,{"$f":"Data!G14","v":430.7},{"$f":"Data!L14","v":"SCO"},{"$f":"Data!M14","v":0},{"$f":"IF(Data!Q14=\"NOT OPERATIONAL\",\"X\",IF(Data!Q14=\"OPERATIONAL\",\"W\",\"R\"))","v":"X"},{"$f":"Data!N14","v":"DM DS FU NX "},null,null,null,"EASTANGLIA",29.62]
[null,{"$f":"Data!K15","v":"ERDINGTON"},{"$f":"Data!D15","v":"G1TTR"},{"$f":"Data!F15","v":433.3},5,{"$f":"Data!G15","v":438.3},{"$f":"Data!L15","v":"MID"},{"$f":"Data!M15","v":67},{"$f":"IF(Data!Q15=\"NOT OPERATIONAL\",\"X\",IF(Data!Q15=\"OPERATIONAL\",\"W\",\"R\"))","v":"W"},{"$f":"Data!N15","v":"A DM "},null,null,null,"IRELAND",29.64]
[null,{"$f":"Data!K16","v":"HAVERHILL"},{"$f":"Data!D16","v":"G1YFF"},{"$f":"Data!F16","v":433.2},1.6000000000000227,{"$f":"Data!G16","v":434.8},{"$f":"Data!L16","v":"EA"},{"$f":"Data!M16","v":210.7},{"$f":"IF(Data!Q16=\"NOT OPERATIONAL\",\"X\",IF(Data!Q16=\"OPERATIONAL\",\"W\",\"R\"))","v":"W"},{"$f":"Data!N16","v":"A "},null,null,null,"MIDLANDS",29.65]
[null,{"$f":"Data!K17","v":"STOURBRIDGE"},{"$f":"Data!D17","v":"G3PWJ"},{"$f":"Data!F17","v":433.26249999999999},5,{"$f":"Data!G17","v":438.26249999999999},{"$f":"Data!L17","v":"MID"},{"$f":"Data!M17","v":67},{"$f":"IF(Data!Q17=\"NOT OPERATIONAL\",\"X\",IF(Data!Q17=\"OPERATIONAL\",\"W\",\"R\"))","v":"X"},{"$f":"Data!N17","v":"A DM "},null,null,null,"NORTH",29.69]
[null,{"$f":"Data!K18","v":"SCUNTHORPE"},{"$f":"Data!D18","v":"G4IPE"},{"$f":"Data!F18","v":430.91250000000002},7.5999999999999659,{"$f":"Data!G18","v":438.51249999999999},{"$f":"Data!L18","v":"MID"},{"$f":"Data!M18","v":77},{"$f":"IF(Data!Q18=\"NOT OPERATIONAL\",\"X\",IF(Data!Q18=\"OPERATIONAL\",\"W\",\"R\"))","v":"W"},{"$f":"Data!N18","v":"A "},null,null,null,"SCOTLAND",50.72]
[null,{"$f":"Data!K19","v":"ASHINGTON"},{"$f":"Data!D19","v":"G4NAB"},{"$f":"Data!F19","v":430.9},7.6000000000000227,{"$f":"Data!G19","v":438.5},{"$f":"Data!L19","v":"NOR"},{"$f":"Data!M19","v":118.8},{"$f":"IF(Data!Q19=\"NOT OPERATIONAL\",\"X\",IF(Data!Q19=\"OPERATIONAL\",\"W\",\"R\"))","v":"W"},{"$f":"Data!N19","v":"A "},null,null,null,"SOUTHEAST",50.73]
[null,{"$f":"Data!K20","v":"SHIPHAM"},{"$f":"Data!D20","v":"G4RKY"},{"$f":"Data!F20","v":438.38749999999999},-7.5999999999999659,{"$f":"Data!G20","v":430.78750000000002},{"$f":"Data!L20","v":"SW"},{"$f":"Data!M20","v":77},{"$f":"IF(Data!Q20=\"NOT OPERATIONAL\",\"X\",IF(Data!Q20=\"OPERATIONAL\",\"W\",\"R\"))","v":"X"},{"$f":"Data!N20","v":"A "},null,null,null,"SOUTHWEST",50.74]
[null,{"$f":"Data!K21","v":"KINGSWINFORD"},{"$f":"Data!D21","v":"G4VZO"},{"$f":"Data!F21","v":433.25},5,{"$f":"Data!G21","v":438.25},{"$f":"Data!L21","v":"MID"},{"$f":"Data!M21","v":123},{"$f":"IF(Data!Q21=\"NOT OPERATIONAL\",\"X\",IF(Data!Q21=\"OPERATIONAL\",\"W\",\"R\"))","v":"W"},{"$f":"Data!N21","v":"A DM NX "},null,null,null,"WESTMIDLANDS",50.75]
[null,{"$f":"Data!K22","v":"SURREY"},{"$f":"Data!D22","v":"G5BSD"},{"$f":"Data!F22","v":430.97500000000002},7.5999999999999659,{"$f":"Data!G22","v":438.57499999999999},{"$f":"Data!L22","v":"SE"},{"$f":"Data!M22","v":82.5},{"$f":"IF(Data!Q22=\"NOT OPERATIONAL\",\"X\",IF(Data!Q22=\"OPERATIONAL\",\"W\",\"R\"))","v":"W"},{"$f":"Data!N22","v":"A "},null,null,null,"OUTPUT",50.76]
[null,{"$f":"Data!K23","v":"CHESHAM"},{"$f":"Data!D23","v":"G8YDE"},{"$f":"Data!F23","v":439.57499999999999},-9,{"$f":"Data!G23","v":430.57499999999999},{"$f":"Data!L23","v":"SE"},{"$f":"Data!M23","v":0},{"$f":"IF(Data!Q23=\"NOT OPERATIONAL\",\"X\",IF(Data!Q23=\"OPERATIONAL\",\"W\",\"R\"))","v":"W"},{"$f":"Data!N23","v":"DM "},null,null,null,null,50.77]
[null,{"$f":"Data!K24","v":"BRISTOL"},{"$f":"Data!D24","v":"GB3AA"},{"$f":"Data!F24","v":145.66249999999999},-0.59999999999999432,{"$f":"Data!G24","v":145.0625},{"$f":"Data!L24","v":"SW"},{"$f":"Data!M24","v":94.8},{"$f":"IF(Data!Q24=\"NOT OPERATIONAL\",\"X\",IF(Data!Q24=\"OPERATIONAL\",\"W\",\"R\"))","v":"W"},{"$f":"Data!N24","v":"A "},null,null,null,null,50.78]
[null,{"$f":"Data!K25","v":"SHEFFIELD"},{"$f":"Data!D25","v":"GB3AB"},{"$f":"Data!F25","v":433.375},1.6000000000000227,{"$f":"Data!G25","v":434.97500000000002},{"$f":"Data!L25","v":"NOR"},{"$f":"Data!M25","v":82.5},{"$f":"IF(Data!Q25=\"NOT OPERATIONAL\",\"X\",IF(Data!Q25=\"OPERATIONAL\",\"W\",\"R\"))","v":"W"},{"$f":"Data!N25","v":"A "},null,null,null,null,50.79]
[null,{"$f":"Data!K26","v":"BRISTOL"},{"$f":"Data!D26","v":"GB3AC"},{"$f":"Data!F26","v":430.97500000000002},7.5999999999999659,{"$f":"Data!G26","v":438.57499999999999},{"$f":"Data!L26","v":"SW"},{"$f":"Data!M26","v":94.8},{"$f":"IF(Data!Q26=\"NOT OPERATIONAL\",\"X\",IF(Data!Q26=\"OPERATIONAL\",\"W\",\"R\"))","v":"W"},{"$f":"Data!N26","v":"A "},null,null,null,null,50.8]
[null,{"$f":"Data!K27","v":"HAWICK"},{"$f":"Data!D27","v":"GB3AD"},{"$f":"Data!F27","v":438.38749999999999},-7.5999999999999659,{"$f":"Data!G27","v":430.78750000000002},{"$f":"Data!L27","v":"SCO"},{"$f":"Data!M27","v":118.8},{"$f":"IF(Data!Q27=\"NOT OPERATIONAL\",\"X\",IF(Data!Q27=\"OPERATIONAL\",\"W\",\"R\"))","v":"X"},{"$f":"Data!N27","v":"A "},null,null,null,null,50.81]
[null,{"$f":"Data!K28","v":"ANGUS"},{"$f":"Data!D28","v":"GB3AG"},{"$f":"Data!F28","v":145.72499999999999},-0.59999999999999432,{"$f":"Data!G28","v":145.125},{"$f":"Data!L28","v":"SCO"},{"$f":"Data!M28","v":94.8},{"$f":"IF(Data!Q28=\"NOT OPERATIONAL\",\"X\",IF(Data!Q28=\"OPERATIONAL\",\"W\",\"R\"))","v":"W"},{"$f":"Data!N28","v":"A FU "},null,null,null,null,50.82]
[null,{"$f":"Data!K29","v":"EAST DEREHAM"},{"$f":"Data!D29","v":"GB3AH"},{"$f":"Data!F29","v":433.27499999999998},1.6000000000000227,{"$f":"Data!G29","v":434.875},{"$f":"Data!L29","v":"EA"},{"$f":"Data!M29","v":94.8},{"$f":"IF(Data!Q29=\"NOT OPERATIONAL\",\"X\",IF(Data!Q29=\"OPERATIONAL\",\"W\",\"R\"))","v":"W"},{"$f":"Data!N29","v":"A "},null,null,null,null,50.84]
[null,{"$f":"Data!K30","v":"AMERSHAM"},{"$f":"Data!D30","v":"GB3AL"},{"$f":"Data!F30","v":145.73750000000001},-0.60000000000002274,{"$f":"Data!G30","v":145.13749999999999},{"$f":"Data!L30","v":"SE"},{"$f":"Data!M30","v":77},{"$f":"IF(Data!Q30=\"NOT OPERATIONAL\",\"X\",IF(Data!Q30=\"OPERATIONAL\",\"W\",\"R\"))","v":"W"},{"$f":"Data!N30","v":"A "},null,null,null,null,50.85]
[null,{"$f":"Data!K31","v":"AMERSHAM"},{"$f":"Data!D31","v":"GB3AM"},{"$f":"Data!F31","v":50.84},0.5,{"$f":"Data!G31","v":51.34},{"$f":"Data!L31","v":"SE"},{"$f":"Data!M31","v":77},{"$f":"IF(Data!Q31=\"NOT OPERATIONAL\",\"X\",IF(Data!Q31=\"OPERATIONAL\",\"W\",\"R\"))","v":"W"},{"$f":"Data!N31","v":"A "},null,null,null,null,50.86]
[null,{"$f":"Data!K32","v":"AMLWCH"},{"$f":"Data!D32","v":"GB3AN"},{"$f":"Data!F32","v":433.2},1.6000000000000227,{"$f":"Data!G32","v":434.8},{"$f":"Data!L32","v":"WM"},{"$f":"Data!M32","v":110.9},{"$f":"IF(Data!Q32=\"NOT OPERATIONAL\",\"X\",IF(Data!Q32=\"OPERATIONAL\",\"W\",\"R\"))","v":"W"},{"$f":"Data!N32","v":"A FU "},null,null,null,null,145.6]
[null,{"$f":"Data!K33","v":"CAERNARFON"},{"$f":"Data!D33","v":"GB3AR"},{"$f":"Data!F33","v":145.69999999999999},-0.59999999999999432,{"$f":"Data!G33","v":145.1},{"$f":"Data!L33","v":"WM"},{"$f":"Data!M33","v":110.9},{"$f":"IF(Data!Q33=\"NOT OPERATIONAL\",\"X\",IF(Data!Q33=\"OPERATIONAL\",\"W\",\"R\"))","v":"W"},{"$f":"Data!N33","v":"A FU "},null,null,null,null,145.61250000000001]
[null,{"$f":"Data!K34","v":"LANGHOLM"},{"$f":"Data!D34","v":"GB3AS"},{"$f":"Data!F34","v":145.6},-0.59999999999999432,{"$f":"Data!G34","v":145},{"$f":"Data!L34","v":"SCO"},{"$f":"Data!M34","v":77},{"$f":"IF(Data!Q34=\"NOT OPERATIONAL\",\"X\",IF(Data!Q34=\"OPERATIONAL\",\"W\",\"R\"))","v":"W"},{"$f":"Data!N34","v":"A "},null,null,null,null,145.625]
[null,{"$f":"Data!K35","v":"AMERSHAM"},{"$f":"Data!D35","v":"GB3AU"},{"$f":"Data!F35","v":433.17500000000001},1.5999999999999659,{"$f":"Data!G35","v":434.77499999999998},{"$f":"Data!L35","v":"SE"},{"$f":"Data!M35","v":82.5},{"$f":"IF(Data!Q35=\"NOT OPERATIONAL\",\"X\",IF(Data!Q35=\"OPERATIONAL\",\"W\",\"R\"))","v":"W"},{"$f":"Data!N35","v":"A "},null,null,null,null,145.63749999999999]
[null,{"$f":"Data!K36","v":"AYLESBURY"},{"$f":"Data!D36","v":"GB3AV"},{"$f":"Data!F36","v":433.05},1.5999999999999659,{"$f":"Data!G36","v":434.65},{"$f":"Data!L36","v":"SE"},{"$f":"Data!M36","v":118.8},{"$f":"IF(Data!Q36=\"NOT OPERATIONAL\",\"X\",IF(Data!Q36=\"OPERATIONAL\",\"W\",\"R\"))","v":"W"},{"$f":"Data!N36","v":"A "},null,null,null,null,145.65]
[null,{"$f":"Data!K37","v":"NEWBURY"},{"$f":"Data!D37","v":"GB3AW"},{"$f":"Data!F37","v":433.25},1.6000000000000227,{"$f":"Data!G37","v":434.85},{"$f":"Data!L37","v":"SW"},{"$f":"Data!M37","v":71.900000000000006},{"$f":"IF(Data!Q37=\"NOT OPERATIONAL\",\"X\",IF(Data!Q37=\"OPERATIONAL\",\"W\",\"R\"))","v":"W"},{"$f":"Data!N37","v":"A "},null,null,null,null,145.66249999999999]
[null,{"$f":"Data!K38","v":"DALRY"},{"$f":"Data!D38","v":"GB3AY"},{"$f":"Data!F38","v":145.65},-0.59999999999999432,{"$f":"Data!G38","v":145.05000000000001},{"$f":"Data!L38","v":"SCO"},{"$f":"Data!M38","v":103.5},{"$f":"IF(Data!Q38=\"NOT OPERATIONAL\",\"X\",IF(Data!Q38=\"OPERATIONAL\",\"W\",\"R\"))","v":"X"},{"$f":"Data!N38","v":"A "},null,null,null,null,145.67500000000001]
[null,{"$f":"Data!K39","v":"BASINGSTOKE"},{"$f":"Data!D39","v":"GB3BA"},{"$f":"Data!F39","v":433.32499999999999},5,{"$f":"Data!G39","v":438.32499999999999},{"$f":"Data!L39","v":"SW"},{"$f":"Data!M39","v":71.900000000000006},{"$f":"IF(Data!Q39=\"NOT OPERATIONAL\",\"X\",IF(Data!Q39=\"OPERATIONAL\",\"W\",\"R\"))","v":"W"},{"$f":"Data!N39","v":"A "},null,null,null,null,145.6875]
[null,{"$f":"Data!K40","v":"BRECON"},{"$f":"Data!D40","v":"GB3BB"},{"$f":"Data!F40","v":145.69999999999999},-0.59999999999999432,{"$f":"Data!G40","v":145.1},{"$f":"Data!L40","v":"WM"},{"$f":"Data!M40","v":94.8},{"$f":"IF(Data!Q40=\"NOT OPERATIONAL\",\"X\",IF(Data!Q40=\"OPERATIONAL\",\"W\",\"R\"))","v":"W"},{"$f":"Data!N40","v":"A "},null,null,null,null,145.69999999999999]
[null,{"$f":"Data!K41","v":"PONTYPRIDD"},{"$f":"Data!D41","v":"GB3BC"},{"$f":"Data!F41","v":145.75},-0.59999999999999432,{"$f":"Data!G41","v":145.15},{"$f":"Data!L41","v":"WM"},{"$f":"Data!M41","v":94.8},{"$f":"IF(Data!Q41=\"NOT OPERATIONAL\",\"X\",IF(Data!Q41=\"OPERATIONAL\",\"W\",\"R\"))","v":"W"},{"$f":"Data!N41","v":"A "},null,null,null,null,145.71250000000001]
[null,{"$f":"Data!K42","v":"BANBURY"},{"$f":"Data!D42","v":"GB3BD"},{"$f":"Data!F42","v":430.8125},7.6000000000000227,{"$f":"Data!G42","v":438.41250000000002},{"$f":"Data!L42","v":"SW"},{"$f":"Data!M42","v":71.900000000000006},{"$f":"IF(Data!Q42=\"NOT OPERATIONAL\",\"X\",IF(Data!Q42=\"OPERATIONAL\",\"W\",\"R\"))","v":"W"},{"$f":"Data!N42","v":"A "},null,null,null,null,145.72499999999999]
[null,{"$f":"Data!K43","v":"DUNS"},{"$f":"Data!D43","v":"GB3BE"},{"$f":"Data!F43","v":430.86250000000001},7.5999999999999659,{"$f":"Data!G43","v":438.46249999999998},{"$f":"Data!L43","v":"SCO"},{"$f":"Data!M43","v":118.8},{"$f":"IF(Data!Q43=\"NOT OPERATIONAL\",\"X\",IF(Data!Q43=\"OPERATIONAL\",\"W\",\"R\"))","v":"R"},{"$f":"Data!N43","v":"A FU "},null,null,null,null,145.73750000000001]
[null,{"$f":"Data!K44","v":"BEDFORD"},{"$f":"Data!D44","v":"GB3BF"},{"$f":"Data!F44","v":145.78749999999999},-0.59999999999999432,{"$f":"Data!G44","v":145.1875},{"$f":"Data!L44","v":"SE"},{"$f":"Data!M44","v":77},{"$f":"IF(Data!Q44=\"NOT OPERATIONAL\",\"X\",IF(Data!Q44=\"OPERATIONAL\",\"W\",\"R\"))","v":"W"},{"$f":"Data!N44","v":"A "},null,null,null,null,145.75]
[null,{"$f":"Data!K45","v":"CHULMLEIGH"},{"$f":"Data!D45","v":"GB3BG"},{"$f":"Data!F45","v":145.75},-0.59999999999999432,{"$f":"Data!G45","v":145.15},{"$f":"Data!L45","v":"SW"},{"$f":"Data!M45","v":118.8},{"$f":"IF(Data!Q45=\"NOT OPERATIONAL\",\"X\",IF(Data!Q45=\"OPERATIONAL\",\"W\",\"R\"))","v":"W"},{"$f":"Data!N45","v":"A DM "},null,null,null,null,145.76249999999999]
[null,{"$f":"Data!K46","v":"BEXHILL-ON-SEA"},{"$f":"Data!D46","v":"GB3BH"},{"$f":"Data!F46","v":430.98750000000001},7.5999999999999659,{"$f":"Data!G46","v":438.58749999999998},{"$f":"Data!L46","v":"SE"},{"$f":"Data!M46","v":77},{"$f":"IF(Data!Q46=\"NOT OPERATIONAL\",\"X\",IF(Data!Q46=\"OPERATIONAL\",\"W\",\"R\"))","v":"W"},{"$f":"Data!N46","v":"A DM "},null,null,null,null,145.77500000000001]
[null,{"$f":"Data!K47","v":"MUIR OF ORD"},{"$f":"Data!D47","v":"GB3BI"},{"$f":"Data!F47","v":145.72499999999999},-0.59999999999999432,{"$f":"Data!G47","v":145.125},{"$f":"Data!L47","v":"SCO"},{"$f":"Data!M47","v":67},{"$f":"IF(Data!Q47=\"NOT OPERATIONAL\",\"X\",IF(Data!Q47=\"OPERATIONAL\",\"W\",\"R\"))","v":"W"},{"$f":"Data!N47","v":"A "},null,null,null,null,145.78749999999999]
[null,{"$f":"Data!K48","v":"BROMLEY"},{"$f":"Data!D48","v":"GB3BK"},{"$f":"Data!F48","v":430.9},7.6000000000000227,{"$f":"Data!G48","v":438.5},{"$f":"Data!L48","v":"SE"},{"$f":"Data!M48","v":103.5},{"$f":"IF(Data!Q48=\"NOT OPERATIONAL\",\"X\",IF(Data!Q48=\"OPERATIONAL\",\"W\",\"R\"))","v":"W"},{"$f":"Data!N48","v":"A "},null,null,null,null,430.25]
[null,{"$f":"Data!K49","v":"BEDFORD"},{"$f":"Data!D49","v":"GB3BL"},{"$f":"Data!F49","v":430.875},7.6000000000000227,{"$f":"Data!G49","v":438.47500000000002},{"$f":"Data!L49","v":"SE"},{"$f":"Data!M49","v":77},{"$f":"IF(Data!Q49=\"NOT OPERATIONAL\",\"X\",IF(Data!Q49=\"OPERATIONAL\",\"W\",\"R\"))","v":"W"},{"$f":"Data!N49","v":"A "},null,null,null,null,430.26249999999999]
[null,{"$f":"Data!K50","v":"DUDLEY"},{"$f":"Data!D50","v":"GB3BM"},{"$f":"Data!F50","v":145.71250000000001},-0.59999999999999432,{"$f":"Data!G50","v":145.11250000000001},{"$f":"Data!L50","v":"MID"},{"$f":"Data!M50","v":67},{"$f":"IF(Data!Q50=\"NOT OPERATIONAL\",\"X\",IF(Data!Q50=\"OPERATIONAL\",\"W\",\"R\"))","v":"W"},{"$f":"Data!N50","v":"A "},null,null,null,null,430.27499999999998]
[null,{"$f":"Data!K51","v":"BIRMINGHAM"},{"$f":"Data!D51","v":"GB3BM-2"},{"$f":"Data!F51","v":145.71250000000001},-0.59999999999999432,{"$f":"Data!G51","v":145.11250000000001},{"$f":"Data!L51","v":"MID"},{"$f":"Data!M51","v":67},{"$f":"IF(Data!Q51=\"NOT OPERATIONAL\",\"X\",IF(Data!Q51=\"OPERATIONAL\",\"W\",\"R\"))","v":"W"},{"$f":"Data!N51","v":"A "},null,null,null,null,430.28750000000002]
[null,{"$f":"Data!K52","v":"BRACKNELL"},{"$f":"Data!D52","v":"GB3BN"},{"$f":"Data!F52","v":433},1.6000000000000227,{"$f":"Data!G52","v":434.6},{"$f":"Data!L52","v":"SW"},{"$f":"Data!M52","v":118.8},{"$f":"IF(Data!Q52=\"NOT OPERATIONAL\",\"X\",IF(Data!Q52=\"OPERATIONAL\",\"W\",\"R\"))","v":"W"},{"$f":"Data!N52","v":"A "},null,null,null,null,430.3]
[null,{"$f":"Data!K53","v":"HEMEL HEMPSTEAD "},{"$f":"Data!D53","v":"GB3BP"},{"$f":"Data!F53","v":430.96249999999998},7.6000000000000227,{"$f":"Data!G53","v":438.5625},{"$f":"Data!L53","v":"SE"},{"$f":"Data!M53","v":82.5},{"$f":"IF(Data!Q53=\"NOT OPERATIONAL\",\"X\",IF(Data!Q53=\"OPERATIONAL\",\"W\",\"R\"))","v":"W"},{"$f":"Data!N53","v":"A "},null,null,null,null,430.8]
[null,{"$f":"Data!K54","v":"HOVE"},{"$f":"Data!D54","v":"GB3BR"},{"$f":"Data!F54","v":430.8125},7.6000000000000227,{"$f":"Data!G54","v":438.41250000000002},{"$f":"Data!L54","v":"SE"},{"$f":"Data!M54","v":88.5},{"$f":"IF(Data!Q54=\"NOT OPERATIONAL\",\"X\",IF(Data!Q54=\"OPERATIONAL\",\"W\",\"R\"))","v":"W"},{"$f":"Data!N54","v":"A "},null,null,null,null,430.8125]
[null,{"$f":"Data!K55","v":"BRISTOL"},{"$f":"Data!D55","v":"GB3BS"},{"$f":"Data!F55","v":430.85},7.5999999999999659,{"$f":"Data!G55","v":438.45},{"$f":"Data!L55","v":"SW"},{"$f":"Data!M55","v":118.8},{"$f":"IF(Data!Q55=\"NOT OPERATIONAL\",\"X\",IF(Data!Q55=\"OPERATIONAL\",\"W\",\"R\"))","v":"W"},{"$f":"Data!N55","v":"A "},null,null,null,null,430.82499999999999]
[null,{"$f":"Data!K56","v":"BERWICK ON TWEED"},{"$f":"Data!D56","v":"GB3BT"},{"$f":"Data!F56","v":145.69999999999999},-0.59999999999999432,{"$f":"Data!G56","v":145.1},{"$f":"Data!L56","v":"SCO"},{"$f":"Data!M56","v":118.8},{"$f":"IF(Data!Q56=\"NOT OPERATIONAL\",\"X\",IF(Data!Q56=\"OPERATIONAL\",\"W\",\"R\"))","v":"W"},{"$f":"Data!N56","v":"A DM FU "},null,null,null,null,430.83749999999998]
[null,{"$f":"Data!K57","v":"BUDE"},{"$f":"Data!D57","v":"GB3BU"},{"$f":"Data!F57","v":430.96249999999998},7.6000000000000227,{"$f":"Data!G57","v":438.5625},{"$f":"Data!L57","v":"SW"},{"$f":"Data!M57","v":77},{"$f":"IF(Data!Q57=\"NOT OPERATIONAL\",\"X\",IF(Data!Q57=\"OPERATIONAL\",\"W\",\"R\"))","v":"W"},{"$f":"Data!N57","v":"DM "},null,null,null,null,430.85]
[null,{"$f":"Data!K58","v":"HEMEL HEMPSTEAD"},{"$f":"Data!D58","v":"GB3BV"},{"$f":"Data!F58","v":433.02499999999998},1.6000000000000227,{"$f":"Data!G58","v":434.625},{"$f":"Data!L58","v":"SE"},{"$f":"Data!M58","v":82.5},{"$f":"IF(Data!Q58=\"NOT OPERATIONAL\",\"X\",IF(Data!Q58=\"OPERATIONAL\",\"W\",\"R\"))","v":"W"},{"$f":"Data!N58","v":"A FU "},null,null,null,null,430.86250000000001]
[null,{"$f":"Data!K59","v":"WAKEFIELD"},{"$f":"Data!D59","v":"GB3BW"},{"$f":"Data!F59","v":430.8125},7.6000000000000227,{"$f":"Data!G59","v":438.41250000000002},{"$f":"Data!L59","v":"NOR"},{"$f":"Data!M59","v":107.2},{"$f":"IF(Data!Q59=\"NOT OPERATIONAL\",\"X\",IF(Data!Q59=\"OPERATIONAL\",\"W\",\"R\"))","v":"W"},{"$f":"Data!N59","v":"A "},null,null,null,null,430.875]
[null,{"$f":"Data!K60","v":"CLEOBURY NORTH"},{"$f":"Data!D60","v":"GB3BX"},{"$f":"Data!F60","v":145.67500000000001},-0.60000000000002274,{"$f":"Data!G60","v":145.07499999999999},{"$f":"Data!L60","v":"MID"},{"$f":"Data!M60","v":0},{"$f":"IF(Data!Q60=\"NOT OPERATIONAL\",\"X\",IF(Data!Q60=\"OPERATIONAL\",\"W\",\"R\"))","v":"R"},{"$f":"Data!N60","v":"DM "},null,null,null,null,430.88749999999999]
[null,{"$f":"Data!K61","v":"CHORLEY"},{"$f":"Data!D61","v":"GB3BY"},{"$f":"Data!F61","v":430.97500000000002},7.5999999999999659,{"$f":"Data!G61","v":438.57499999999999},{"$f":"Data!L61","v":"NOR"},{"$f":"Data!M61","v":82.5},{"$f":"IF(Data!Q61=\"NOT OPERATIONAL\",\"X\",IF(Data!Q61=\"OPERATIONAL\",\"W\",\"R\"))","v":"W"},{"$f":"Data!N61","v":"A "},null,null,null,null,430.9]
[null,{"$f":"Data!K62","v":"BRAINTREE"},{"$f":"Data!D62","v":"GB3BZ"},{"$f":"Data!F62","v":430.85},7.5999999999999659,{"$f":"Data!G62","v":438.45},{"$f":"Data!L62","v":"EA"},{"$f":"Data!M62","v":110.9},{"$f":"IF(Data!Q62=\"NOT OPERATIONAL\",\"X\",IF(Data!Q62=\"OPERATIONAL\",\"W\",\"R\"))","v":"W"},{"$f":"Data!N62","v":"A DM "},null,null,null,null,430.91250000000002]
[null,{"$f":"Data!K63","v":"CARLISLE"},{"$f":"Data!D63","v":"GB3CA"},{"$f":"Data!F63","v":433.32499999999999},1.6000000000000227,{"$f":"Data!G63","v":434.92500000000001},{"$f":"Data!L63","v":"NOR"},{"$f":"Data!M63","v":77},{"$f":"IF(Data!Q63=\"NOT OPERATIONAL\",\"X\",IF(Data!Q63=\"OPERATIONAL\",\"W\",\"R\"))","v":"W"},{"$f":"Data!N63","v":"A "},null,null,null,null,430.92500000000001]
[null,{"$f":"Data!K64","v":"BIRMINGHAM"},{"$f":"Data!D64","v":"GB3CB"},{"$f":"Data!F64","v":433.35},1.5999999999999659,{"$f":"Data!G64","v":434.95},{"$f":"Data!L64","v":"MID"},{"$f":"Data!M64","v":67},{"$f":"IF(Data!Q64=\"NOT OPERATIONAL\",\"X\",IF(Data!Q64=\"OPERATIONAL\",\"W\",\"R\"))","v":"W"},{"$f":"Data!N64","v":"A "},null,null,null,null,430.9375]
[null,{"$f":"Data!K65","v":"CHICHESTER"},{"$f":"Data!D65","v":"GB3CC"},{"$f":"Data!F65","v":430.96249999999998},7.6000000000000227,{"$f":"Data!G65","v":438.5625},{"$f":"Data!L65","v":"SE"},{"$f":"Data!M65","v":88.5},{"$f":"IF(Data!Q65=\"NOT OPERATIONAL\",\"X\",IF(Data!Q65=\"OPERATIONAL\",\"W\",\"R\"))","v":"W"},{"$f":"Data!N65","v":"A "},null,null,null,null,430.95]
[null,{"$f":"Data!K66","v":"CROOK"},{"$f":"Data!D66","v":"GB3CD"},{"$f":"Data!F66","v":145.6875},-0.59999999999999432,{"$f":"Data!G66","v":145.08750000000001},{"$f":"Data!L66","v":"NOR"},{"$f":"Data!M66","v":118.8},{"$f":"IF(Data!Q66=\"NOT OPERATIONAL\",\"X\",IF(Data!Q66=\"OPERATIONAL\",\"W\",\"R\"))","v":"W"},{"$f":"Data!N66","v":"A FU "},null,null,null,null,430.96249999999998]
[null,{"$f":"Data!K67","v":"COLCHESTER"},{"$f":"Data!D67","v":"GB3CE"},{"$f":"Data!F67","v":433.35},1.5999999999999659,{"$f":"Data!G67","v":434.95},{"$f":"Data!L67","v":"EA"},{"$f":"Data!M67","v":67},{"$f":"IF(Data!Q67=\"NOT OPERATIONAL\",\"X\",IF(Data!Q67=\"OPERATIONAL\",\"W\",\"R\"))","v":"W"},{"$f":"Data!N67","v":"A "},null,null,null,null,430.97500000000002]
[null,{"$f":"Data!K68","v":"MARKFIELD"},{"$f":"Data!D68","v":"GB3CF"},{"$f":"Data!F68","v":145.6},-0.59999999999999432,{"$f":"Data!G68","v":145},{"$f":"Data!L68","v":"MID"},{"$f":"Data!M68","v":77},{"$f":"IF(Data!Q68=\"NOT OPERATIONAL\",\"X\",IF(Data!Q68=\"OPERATIONAL\",\"W\",\"R\"))","v":"W"},{"$f":"Data!N68","v":"A DS FU NX "},null,null,null,null,430.98750000000001]
[null,{"$f":"Data!K69","v":"GLOUCESTER"},{"$f":"Data!D69","v":"GB3CG"},{"$f":"Data!F69","v":145.72499999999999},-0.59999999999999432,{"$f":"Data!G69","v":145.125},{"$f":"Data!L69","v":"SW"},{"$f":"Data!M69","v":118.8},{"$f":"IF(Data!Q69=\"NOT OPERATIONAL\",\"X\",IF(Data!Q69=\"OPERATIONAL\",\"W\",\"R\"))","v":"W"},{"$f":"Data!N69","v":"A "},null,null,null,null,433]
[null,{"$f":"Data!K70","v":"LISKEARD"},{"$f":"Data!D70","v":"GB3CH"},{"$f":"Data!F70","v":430.875},7.6000000000000227,{"$f":"Data!G70","v":438.47500000000002},{"$f":"Data!L70","v":"SW"},{"$f":"Data!M70","v":77},{"$f":"IF(Data!Q70=\"NOT OPERATIONAL\",\"X\",IF(Data!Q70=\"OPERATIONAL\",\"W\",\"R\"))","v":"X"},{"$f":"Data!N70","v":"A "},null,null,null,null,433.02499999999998]
[null,{"$f":"Data!K71","v":"CORBY"},{"$f":"Data!D71","v":"GB3CI"},{"$f":"Data!F71","v":430.82499999999999},7.6000000000000227,{"$f":"Data!G71","v":438.42500000000001},{"$f":"Data!L71","v":"MID"},{"$f":"Data!M71","v":77},{"$f":"IF(Data!Q71=\"NOT OPERATIONAL\",\"X\",IF(Data!Q71=\"OPERATIONAL\",\"W\",\"R\"))","v":"W"},{"$f":"Data!N71","v":"A "},null,null,null,null,433.05]
[null,{"$f":"Data!K72","v":"BOZEAT"},{"$f":"Data!D72","v":"GB3CJ"},{"$f":"Data!F72","v":29.64},-0.10000000000000142,{"$f":"Data!G72","v":29.54},{"$f":"Data!L72","v":"MID"},{"$f":"Data!M72","v":77},{"$f":"IF(Data!Q72=\"NOT OPERATIONAL\",\"X\",IF(Data!Q72=\"OPERATIONAL\",\"W\",\"R\"))","v":"X"},{"$f":"Data!N72","v":"A "},null,null,null,null,433.07499999999999]
[null,{"$f":"Data!K73","v":"CHARING KENT"},{"$f":"Data!D73","v":"GB3CK"},{"$f":"Data!F73","v":433},{"$f":"F73-D73","v":1.6000000000000227},{"$f":"Data!G73","v":434.6},{"$f":"Data!L73","v":"SE"},{"$f":"Data!M73","v":103.5},{"$f":"IF(Data!Q73=\"NOT OPERATIONAL\",\"X\",IF(Data!Q73=\"OPERATIONAL\",\"W\",\"R\"))","v":"X"},{"$f":"Data!N73","v":"A "},null,null,null,null,433.1]
[null,{"$f":"Data!K74","v":"CLACTON"},{"$f":"Data!D74","v":"GB3CL"},{"$f":"Data!F74","v":433.22500000000002},1.5999999999999659,{"$f":"Data!G74","v":434.82499999999999},{"$f":"Data!L74","v":"EA"},{"$f":"Data!M74","v":67},{"$f":"IF(Data!Q74=\"NOT OPERATIONAL\",\"X\",IF(Data!Q74=\"OPERATIONAL\",\"W\",\"R\"))","v":"W"},{"$f":"Data!N74","v":"A "},null,null,null,null,433.125]
[null,{"$f":"Data!K75","v":"CARMARTHEN"},{"$f":"Data!D75","v":"GB3CM"},{"$f":"Data!F75","v":430.86250000000001},7.5999999999999659,{"$f":"Data!G75","v":438.46249999999998},{"$f":"Data!L75","v":"WM"},{"$f":"Data!M75","v":94.8},{"$f":"IF(Data!Q75=\"NOT OPERATIONAL\",\"X\",IF(Data!Q75=\"OPERATIONAL\",\"W\",\"R\"))","v":"W"},{"$f":"Data!N75","v":"A FU "},null,null,null,null,433.15]
[null,{"$f":"Data!K76","v":"NEWCASTLE EMLYN"},{"$f":"Data!D76","v":"GB3CN"},{"$f":"Data!F76","v":145.6875},-0.59999999999999432,{"$f":"Data!G76","v":145.08750000000001},{"$f":"Data!L76","v":"WM"},{"$f":"Data!M76","v":94.8},{"$f":"IF(Data!Q76=\"NOT OPERATIONAL\",\"X\",IF(Data!Q76=\"OPERATIONAL\",\"W\",\"R\"))","v":"W"},{"$f":"Data!N76","v":"A "},null,null,null,null,433.17500000000001]
[null,{"$f":"Data!K77","v":"CORBY"},{"$f":"Data!D77","v":"GB3CO"},{"$f":"Data!F77","v":145.66249999999999},-0.59999999999999432,{"$f":"Data!G77","v":145.0625},{"$f":"Data!L77","v":"MID"},{"$f":"Data!M77","v":77},{"$f":"IF(Data!Q77=\"NOT OPERATIONAL\",\"X\",IF(Data!Q77=\"OPERATIONAL\",\"W\",\"R\"))","v":"X"},{"$f":"Data!N77","v":"A "},null,null,null,null,433.2]
[null,{"$f":"Data!K78","v":"FERMANAGH"},{"$f":"Data!D78","v":"GB3CP"},{"$f":"Data!F78","v":145.73750000000001},-0.60000000000002274,{"$f":"Data!G78","v":145.13749999999999},{"$f":"Data!L78","v":"NI"},{"$f":"Data!M78","v":110.9},{"$f":"IF(Data!Q78=\"NOT OPERATIONAL\",\"X\",IF(Data!Q78=\"OPERATIONAL\",\"W\",\"R\"))","v":"W"},{"$f":"Data!N78","v":"A "},null,null,null,null,433.22500000000002]
[null,{"$f":"Data!K79","v":"WORTHING"},{"$f":"Data!D79","v":"GB3CQ"},{"$f":"Data!F79","v":29.63},-9.9999999999997868E-2,{"$f":"Data!G79","v":29.53},{"$f":"Data!L79","v":"SE"},{"$f":"Data!M79","v":88.5},{"$f":"IF(Data!Q79=\"NOT OPERATIONAL\",\"X\",IF(Data!Q79=\"OPERATIONAL\",\"W\",\"R\"))","v":"W"},{"$f":"Data!N79","v":"A "},null,null,null,null,433.25]
[null,{"$f":"Data!K80","v":"CAERGWRLE"},{"$f":"Data!D80","v":"GB3CR"},{"$f":"Data!F80","v":433.15},1.6000000000000227,{"$f":"Data!G80","v":434.75},{"$f":"Data!L80","v":"WM"},{"$f":"Data!M80","v":110.9},{"$f":"IF(Data!Q80=\"NOT OPERATIONAL\",\"X\",IF(Data!Q80=\"OPERATIONAL\",\"W\",\"R\"))","v":"W"},{"$f":"Data!N80","v":"A "},null,null,null,null,433.27499999999998]
[null,{"$f":"Data!K81","v":"MOTHERWELL"},{"$f":"Data!D81","v":"GB3CS"},{"$f":"Data!F81","v":145.75},-0.59999999999999432,{"$f":"Data!G81","v":145.15},{"$f":"Data!L81","v":"SCO"},{"$f":"Data!M81","v":103.5},{"$f":"IF(Data!Q81=\"NOT OPERATIONAL\",\"X\",IF(Data!Q81=\"OPERATIONAL\",\"W\",\"R\"))","v":"W"},{"$f":"Data!N81","v":"A "},null,null,null,null,433.3]
[null,{"$f":"Data!K82","v":"MARYPORT"},{"$f":"Data!D82","v":"GB3CU"},{"$f":"Data!F82","v":438.38749999999999},-7.5999999999999659,{"$f":"Data!G82","v":430.78750000000002},{"$f":"Data!L82","v":"NOR"},{"$f":"Data!M82","v":77},{"$f":"IF(Data!Q82=\"NOT OPERATIONAL\",\"X\",IF(Data!Q82=\"OPERATIONAL\",\"W\",\"R\"))","v":"X"},{"$f":"Data!N82","v":"A FU "},null,null,null,null,433.32499999999999]
[null,{"$f":"Data!K83","v":"COVENTRY"},{"$f":"Data!D83","v":"GB3CV"},{"$f":"Data!F83","v":439.36250000000001},-9,{"$f":"Data!G83","v":430.36250000000001},{"$f":"Data!L83","v":"MID"},{"$f":"Data!M83","v":67},{"$f":"IF(Data!Q83=\"NOT OPERATIONAL\",\"X\",IF(Data!Q83=\"OPERATIONAL\",\"W\",\"R\"))","v":"W"},{"$f":"Data!N83","v":"A "},null,null,null,null,433.35]
[null,{"$f":"Data!K84","v":"FAREHAM"},{"$f":"Data!D84","v":"GB3CW"},{"$f":"Data!F84","v":145.61250000000001},-0.60000000000002274,{"$f":"Data!G84","v":145.01249999999999},{"$f":"Data!L84","v":"SW"},{"$f":"Data!M84","v":71.900000000000006},{"$f":"IF(Data!Q84=\"NOT OPERATIONAL\",\"X\",IF(Data!Q84=\"OPERATIONAL\",\"W\",\"R\"))","v":"W"},{"$f":"Data!N84","v":"A "},null,null,null,null,433.375]
[null,{"$f":"Data!K85","v":"YORK"},{"$f":"Data!D85","v":"GB3CY"},{"$f":"Data!F85","v":430.86250000000001},7.5999999999999659,{"$f":"Data!G85","v":438.46249999999998},{"$f":"Data!L85","v":"NOR"},{"$f":"Data!M85","v":88.5},{"$f":"IF(Data!Q85=\"NOT OPERATIONAL\",\"X\",IF(Data!Q85=\"OPERATIONAL\",\"W\",\"R\"))","v":"W"},{"$f":"Data!N85","v":"A "},null,null,null,null,438.38749999999999]
[null,{"$f":"Data!K86","v":"DANBURY"},{"$f":"Data!D86","v":"GB3DA"},{"$f":"Data!F86","v":145.72499999999999},-0.59999999999999432,{"$f":"Data!G86","v":145.125},{"$f":"Data!L86","v":"EA"},{"$f":"Data!M86","v":110.9},{"$f":"IF(Data!Q86=\"NOT OPERATIONAL\",\"X\",IF(Data!Q86=\"OPERATIONAL\",\"W\",\"R\"))","v":"W"},{"$f":"Data!N86","v":"A FU "},null,null,null,null,438.4375]
[null,{"$f":"Data!K87","v":"DANBURY"},{"$f":"Data!D87","v":"GB3DB"},{"$f":"Data!F87","v":50.77},0.5,{"$f":"Data!G87","v":51.27},{"$f":"Data!L87","v":"EA"},{"$f":"Data!M87","v":110.9},{"$f":"IF(Data!Q87=\"NOT OPERATIONAL\",\"X\",IF(Data!Q87=\"OPERATIONAL\",\"W\",\"R\"))","v":"W"},{"$f":"Data!N87","v":"A FU "},null,null,null,null,439.16250000000002]
[null,{"$f":"Data!K88","v":"DERBY"},{"$f":"Data!D88","v":"GB3DC"},{"$f":"Data!F88","v":145.6875},-0.59999999999999432,{"$f":"Data!G88","v":145.08750000000001},{"$f":"Data!L88","v":"MID"},{"$f":"Data!M88","v":71.900000000000006},{"$f":"IF(Data!Q88=\"NOT OPERATIONAL\",\"X\",IF(Data!Q88=\"OPERATIONAL\",\"W\",\"R\"))","v":"W"},{"$f":"Data!N88","v":"A "},null,null,null,null,439.32499999999999]
[null,{"$f":"Data!K89","v":"DUNDEE"},{"$f":"Data!D89","v":"GB3DD"},{"$f":"Data!F89","v":433.25},1.6000000000000227,{"$f":"Data!G89","v":434.85},{"$f":"Data!L89","v":"SCO"},{"$f":"Data!M89","v":94.8},{"$f":"IF(Data!Q89=\"NOT OPERATIONAL\",\"X\",IF(Data!Q89=\"OPERATIONAL\",\"W\",\"R\"))","v":"W"},{"$f":"Data!N89","v":"A FU "},null,null,null,null,439.33749999999998]
[null,{"$f":"Data!K90","v":"IPSWICH"},{"$f":"Data!D90","v":"GB3DE"},{"$f":"Data!F90","v":433.17500000000001},1.5999999999999659,{"$f":"Data!G90","v":434.77499999999998},{"$f":"Data!L90","v":"EA"},{"$f":"Data!M90","v":110.9},{"$f":"IF(Data!Q90=\"NOT OPERATIONAL\",\"X\",IF(Data!Q90=\"OPERATIONAL\",\"W\",\"R\"))","v":"W"},{"$f":"Data!N90","v":"A "},null,null,null,null,439.375]
[null,{"$f":"Data!K91","v":"UPPER DENBY"},{"$f":"Data!D91","v":"GB3DF"},{"$f":"Data!F91","v":439.625},-9,{"$f":"Data!G91","v":430.625},{"$f":"Data!L91","v":"NOR"},{"$f":"Data!M91","v":82.5},{"$f":"IF(Data!Q91=\"NOT OPERATIONAL\",\"X\",IF(Data!Q91=\"OPERATIONAL\",\"W\",\"R\"))","v":"W"},{"$f":"Data!N91","v":"A DS FU "},null,null,null,null,439.4]
[null,{"$f":"Data!K92","v":"NEWTON STEWART"},{"$f":"Data!D92","v":"GB3DG"},{"$f":"Data!F92","v":145.77500000000001},-0.59999999999999432,{"$f":"Data!G92","v":145.17500000000001},{"$f":"Data!L92","v":"SCO"},{"$f":"Data!M92","v":103.5},{"$f":"IF(Data!Q92=\"NOT OPERATIONAL\",\"X\",IF(Data!Q92=\"OPERATIONAL\",\"W\",\"R\"))","v":"W"},{"$f":"Data!N92","v":"A FU "},null,null,null,null,439.41250000000002]
[null,{"$f":"Data!K93","v":"DIDCOT"},{"$f":"Data!D93","v":"GB3DI"},{"$f":"Data!F93","v":433.15},1.6000000000000227,{"$f":"Data!G93","v":434.75},{"$f":"Data!L93","v":"SW"},{"$f":"Data!M93","v":118.8},{"$f":"IF(Data!Q93=\"NOT OPERATIONAL\",\"X\",IF(Data!Q93=\"OPERATIONAL\",\"W\",\"R\"))","v":"W"},{"$f":"Data!N93","v":"A "},null,null,null,null,439.42500000000001]
[null,{"$f":"Data!K94","v":"PETERHEAD"},{"$f":"Data!D94","v":"GB3DK"},{"$f":"Data!F94","v":433},1.6000000000000227,{"$f":"Data!G94","v":434.6},{"$f":"Data!L94","v":"SCO"},{"$f":"Data!M94","v":67},{"$f":"IF(Data!Q94=\"NOT OPERATIONAL\",\"X\",IF(Data!Q94=\"OPERATIONAL\",\"W\",\"R\"))","v":"X"},{"$f":"Data!N94","v":"A "},null,null,null,null,439.4375]
[null,{"$f":"Data!K95","v":"DISS"},{"$f":"Data!D95","v":"GB3DL"},{"$f":"Data!F95","v":439.42500000000001},-9,{"$f":"Data!G95","v":430.42500000000001},{"$f":"Data!L95","v":"EA"},{"$f":"Data!M95","v":110.9},{"$f":"IF(Data!Q95=\"NOT OPERATIONAL\",\"X\",IF(Data!Q95=\"OPERATIONAL\",\"W\",\"R\"))","v":"W"},{"$f":"Data!N95","v":"A DS "},null,null,null,null,439.45]
[null,{"$f":"Data!K96","v":"DUMBARTON"},{"$f":"Data!D96","v":"GB3DM"},{"$f":"Data!F96","v":430.92500000000001},7.5999999999999659,{"$f":"Data!G96","v":438.52499999999998},{"$f":"Data!L96","v":"SCO"},{"$f":"Data!M96","v":103.5},{"$f":"IF(Data!Q96=\"NOT OPERATIONAL\",\"X\",IF(Data!Q96=\"OPERATIONAL\",\"W\",\"R\"))","v":"W"},{"$f":"Data!N96","v":"A DS FU "},null,null,null,null,439.46249999999998]
[null,{"$f":"Data!K97","v":"STIBB CROSS"},{"$f":"Data!D97","v":"GB3DN"},{"$f":"Data!F97","v":145.63749999999999},-0.59999999999999432,{"$f":"Data!G97","v":145.03749999999999},{"$f":"Data!L97","v":"SW"},{"$f":"Data!M97","v":77},{"$f":"IF(Data!Q97=\"NOT OPERATIONAL\",\"X\",IF(Data!Q97=\"OPERATIONAL\",\"W\",\"R\"))","v":"W"},{"$f":"Data!N97","v":"A FU "},null,null,null,null,439.47500000000002]
[null,{"$f":"Data!K98","v":"BASTON"},{"$f":"Data!D98","v":"GB3DP"},{"$f":"Data!F98","v":439.42500000000001},-9,{"$f":"Data!G98","v":430.42500000000001},{"$f":"Data!L98","v":"EA"},{"$f":"Data!M98","v":88.5},{"$f":"IF(Data!Q98=\"NOT OPERATIONAL\",\"X\",IF(Data!Q98=\"OPERATIONAL\",\"W\",\"R\"))","v":"W"},{"$f":"Data!N98","v":"A FU "},null,null,null,null,439.48750000000001]
[null,{"$f":"Data!K99","v":"POLPERRO"},{"$f":"Data!D99","v":"GB3DQ"},{"$f":"Data!F99","v":430.97500000000002},7.5999999999999659,{"$f":"Data!G99","v":438.57499999999999},{"$f":"Data!L99","v":"SW"},{"$f":"Data!M99","v":77},{"$f":"IF(Data!Q99=\"NOT OPERATIONAL\",\"X\",IF(Data!Q99=\"OPERATIONAL\",\"W\",\"R\"))","v":"W"},{"$f":"Data!N99","v":"A "},null,null,null,null,439.49687499999999]
[null,{"$f":"Data!K100","v":"WEYMOUTH"},{"$f":"Data!D100","v":"GB3DR"},{"$f":"Data!F100","v":145.73750000000001},-0.60000000000002274,{"$f":"Data!G100","v":145.13749999999999},{"$f":"Data!L100","v":"SW"},{"$f":"Data!M100","v":0},{"$f":"IF(Data!Q100=\"NOT OPERATIONAL\",\"X\",IF(Data!Q100=\"OPERATIONAL\",\"W\",\"R\"))","v":"W"},{"$f":"Data!N100","v":"A FU "},null,null,null,null,439.5]
[null,{"$f":"Data!K101","v":"WORKSOP"},{"$f":"Data!D101","v":"GB3DS"},{"$f":"Data!F101","v":433.32499999999999},1.6000000000000227,{"$f":"Data!G101","v":434.92500000000001},{"$f":"Data!L101","v":"MID"},{"$f":"Data!M101","v":71.900000000000006},{"$f":"IF(Data!Q101=\"NOT OPERATIONAL\",\"X\",IF(Data!Q101=\"OPERATIONAL\",\"W\",\"R\"))","v":"W"},{"$f":"Data!N101","v":"A "},null,null,null,null,439.50312500000001]
[null,{"$f":"Data!K102","v":"BLANDFORD"},{"$f":"Data!D102","v":"GB3DT"},{"$f":"Data!F102","v":433},1.6000000000000227,{"$f":"Data!G102","v":434.6},{"$f":"Data!L102","v":"SW"},{"$f":"Data!M102","v":71.900000000000006},{"$f":"IF(Data!Q102=\"NOT OPERATIONAL\",\"X\",IF(Data!Q102=\"OPERATIONAL\",\"W\",\"R\"))","v":"W"},{"$f":"Data!N102","v":"A FU "},null,null,null,null,439.51249999999999]
[null,{"$f":"Data!K103","v":"DUNS "},{"$f":"Data!D103","v":"GB3DU"},{"$f":"Data!F103","v":145.76249999999999},-0.59999999999999432,{"$f":"Data!G103","v":145.16249999999999},{"$f":"Data!L103","v":"SCO"},{"$f":"Data!M103","v":118.8},{"$f":"IF(Data!Q103=\"NOT OPERATIONAL\",\"X\",IF(Data!Q103=\"OPERATIONAL\",\"W\",\"R\"))","v":"W"},{"$f":"Data!N103","v":"A DM "},null,null,null,null,439.52499999999998]
[null,{"$f":"Data!K104","v":"DERRY/LONDONDERRY"},{"$f":"Data!D104","v":"GB3DX"},{"$f":"Data!F104","v":433.3},1.5999999999999659,{"$f":"Data!G104","v":434.9},{"$f":"Data!L104","v":"NI"},{"$f":"Data!M104","v":110.9},{"$f":"IF(Data!Q104=\"NOT OPERATIONAL\",\"X\",IF(Data!Q104=\"OPERATIONAL\",\"W\",\"R\"))","v":"W"},{"$f":"Data!N104","v":"A "},null,null,null,null,439.53750000000002]
[null,{"$f":"Data!K105","v":"WIRKSWORTH"},{"$f":"Data!D105","v":"GB3DY"},{"$f":"Data!F105","v":433.25},1.6000000000000227,{"$f":"Data!G105","v":434.85},{"$f":"Data!L105","v":"MID"},{"$f":"Data!M105","v":71.900000000000006},{"$f":"IF(Data!Q105=\"NOT OPERATIONAL\",\"X\",IF(Data!Q105=\"OPERATIONAL\",\"W\",\"R\"))","v":"X"},{"$f":"Data!N105","v":"A DM "},null,null,null,null,439.57499999999999]
[null,{"$f":"Data!K106","v":"DERBY"},{"$f":"Data!D106","v":"GB3DZ"},{"$f":"Data!F106","v":430.98750000000001},7.5999999999999659,{"$f":"Data!G106","v":438.58749999999998},{"$f":"Data!L106","v":"MID"},{"$f":"Data!M106","v":71.900000000000006},{"$f":"IF(Data!Q106=\"NOT OPERATIONAL\",\"X\",IF(Data!Q106=\"OPERATIONAL\",\"W\",\"R\"))","v":"W"},{"$f":"Data!N106","v":"A "},null,null,null,null,439.58749999999998]
[null,{"$f":"Data!K107","v":"BURY ST EDMUNDS "},{"$f":"Data!D107","v":"GB3EA "},{"$f":"Data!F107","v":145.6875},-0.59999999999999432,{"$f":"Data!G107","v":145.08750000000001},{"$f":"Data!L107","v":"EA"},{"$f":"Data!M107","v":110.9},{"$f":"IF(Data!Q107=\"NOT OPERATIONAL\",\"X\",IF(Data!Q107=\"OPERATIONAL\",\"W\",\"R\"))","v":"W"},{"$f":"Data!N107","v":"A "},null,null,null,null,439.6]
[null,{"$f":"Data!K108","v":"NEWHAVEN"},{"$f":"Data!D108","v":"GB3EB"},{"$f":"Data!F108","v":145.78749999999999},-0.59999999999999432,{"$f":"Data!G108","v":145.1875},{"$f":"Data!L108","v":"SE"},{"$f":"Data!M108","v":88.5},{"$f":"IF(Data!Q108=\"NOT OPERATIONAL\",\"X\",IF(Data!Q108=\"OPERATIONAL\",\"W\",\"R\"))","v":"W"},{"$f":"Data!N108","v":"A DM DS "},null,null,null,null,439.61250000000001]
[null,{"$f":"Data!K109","v":"WARRINGTON"},{"$f":"Data!D109","v":"GB3EC"},{"$f":"Data!F109","v":433.1},5,{"$f":"Data!G109","v":438.1},{"$f":"Data!L109","v":"NOR"},{"$f":"Data!M109","v":82.5},{"$f":"IF(Data!Q109=\"NOT OPERATIONAL\",\"X\",IF(Data!Q109=\"OPERATIONAL\",\"W\",\"R\"))","v":"W"},{"$f":"Data!N109","v":"A FU "},null,null,null,null,439.625]
[null,{"$f":"Data!K110","v":"EDINBURGH"},{"$f":"Data!D110","v":"GB3ED"},{"$f":"Data!F110","v":430.88749999999999},7.6000000000000227,{"$f":"Data!G110","v":438.48750000000001},{"$f":"Data!L110","v":"SCO"},{"$f":"Data!M110","v":94.8},{"$f":"IF(Data!Q110=\"NOT OPERATIONAL\",\"X\",IF(Data!Q110=\"OPERATIONAL\",\"W\",\"R\"))","v":"W"},{"$f":"Data!N110","v":"A DS "},null,null,null,null,439.63749999999999]
[null,{"$f":"Data!K111","v":"MANSFIELD"},{"$f":"Data!D111","v":"GB3EE"},{"$f":"Data!F111","v":433.3},1.5999999999999659,{"$f":"Data!G111","v":434.9},{"$f":"Data!L111","v":"MID"},{"$f":"Data!M111","v":71.900000000000006},{"$f":"IF(Data!Q111=\"NOT OPERATIONAL\",\"X\",IF(Data!Q111=\"OPERATIONAL\",\"W\",\"R\"))","v":"W"},{"$f":"Data!N111","v":"A "},null,null,null,null,439.65]
[null,{"$f":"Data!K112","v":"SUFFOLK"},{"$f":"Data!D112","v":"GB3EF"},{"$f":"Data!F112","v":50.72},0.5,{"$f":"Data!G112","v":51.22},{"$f":"Data!L112","v":"EA"},{"$f":"Data!M112","v":110.9},{"$f":"IF(Data!Q112=\"NOT OPERATIONAL\",\"X\",IF(Data!Q112=\"OPERATIONAL\",\"W\",\"R\"))","v":"W"},{"$f":"Data!N112","v":"A "},null,null,null,null,439.66250000000002]
[null,{"$f":"Data!K113","v":"WIGAN"},{"$f":"Data!D113","v":"GB3EG"},{"$f":"Data!F113","v":430.91250000000002},7.5999999999999659,{"$f":"Data!G113","v":438.51249999999999},{"$f":"Data!L113","v":"NOR"},{"$f":"Data!M113","v":82.5},{"$f":"IF(Data!Q113=\"NOT OPERATIONAL\",\"X\",IF(Data!Q113=\"OPERATIONAL\",\"W\",\"R\"))","v":"W"},{"$f":"Data!N113","v":"A "},null,null,null,null,439.67500000000001]
[null,{"$f":"Data!K114","v":"BANBURY"},{"$f":"Data!D114","v":"GB3EH"},{"$f":"Data!F114","v":430.96249999999998},7.6000000000000227,{"$f":"Data!G114","v":438.5625},{"$f":"Data!L114","v":"SW"},{"$f":"Data!M114","v":67},{"$f":"IF(Data!Q114=\"NOT OPERATIONAL\",\"X\",IF(Data!Q114=\"OPERATIONAL\",\"W\",\"R\"))","v":"W"},{"$f":"Data!N114","v":"A "},null,null,null,null,439.6875]
[null,{"$f":"Data!K115","v":"LOCHMADDY"},{"$f":"Data!D115","v":"GB3EI"},{"$f":"Data!F115","v":145.61250000000001},-0.60000000000002274,{"$f":"Data!G115","v":145.01249999999999},{"$f":"Data!L115","v":"SCO"},{"$f":"Data!M115","v":88.5},{"$f":"IF(Data!Q115=\"NOT OPERATIONAL\",\"X\",IF(Data!Q115=\"OPERATIONAL\",\"W\",\"R\"))","v":"W"},{"$f":"Data!N115","v":"A DM DS FU "},null,null,null,null,439.7]
[null,{"$f":"Data!K116","v":"MARGATE"},{"$f":"Data!D116","v":"GB3EK"},{"$f":"Data!F116","v":430.88749999999999},7.6000000000000227,{"$f":"Data!G116","v":438.48750000000001},{"$f":"Data!L116","v":"SE"},{"$f":"Data!M116","v":103.5},{"$f":"IF(Data!Q116=\"NOT OPERATIONAL\",\"X\",IF(Data!Q116=\"OPERATIONAL\",\"W\",\"R\"))","v":"W"},{"$f":"Data!N116","v":"A "},null,null,null,null,439.71249999999998]
[null,{"$f":"Data!K117","v":"ELY"},{"$f":"Data!D117","v":"GB3EL"},{"$f":"Data!F117","v":430.83749999999998},7.6000000000000227,{"$f":"Data!G117","v":438.4375},{"$f":"Data!L117","v":"EA"},{"$f":"Data!M117","v":156.69999999999999},{"$f":"IF(Data!Q117=\"NOT OPERATIONAL\",\"X\",IF(Data!Q117=\"OPERATIONAL\",\"W\",\"R\"))","v":"R"},{"$f":"Data!N117","v":"A "},null,null,null,null,439.72500000000002]
[null,{"$f":"Data!K118","v":"COLD ASHBY"},{"$f":"Data!D118","v":"GB3EM"},{"$f":"Data!F118","v":145.76249999999999},-0.59999999999999432,{"$f":"Data!G118","v":145.16249999999999},{"$f":"Data!L118","v":"MID"},{"$f":"Data!M118","v":77},{"$f":"IF(Data!Q118=\"NOT OPERATIONAL\",\"X\",IF(Data!Q118=\"OPERATIONAL\",\"W\",\"R\"))","v":"W"},{"$f":"Data!N118","v":"A "},null,null,null,null,439.73750000000001]
[null,{"$f":"Data!K119","v":"ILMINSTER"},{"$f":"Data!D119","v":"GB3EQ"},{"$f":"Data!F119","v":145.76249999999999},-0.59999999999999432,{"$f":"Data!G119","v":145.16249999999999},{"$f":"Data!L119","v":"SW"},{"$f":"Data!M119","v":94.8},{"$f":"IF(Data!Q119=\"NOT OPERATIONAL\",\"X\",IF(Data!Q119=\"OPERATIONAL\",\"W\",\"R\"))","v":"W"},{"$f":"Data!N119","v":"A FU "},null,null,null,null,439.75]
[null,{"$f":"Data!K120","v":"DANBURY"},{"$f":"Data!D120","v":"GB3ER"},{"$f":"Data!F120","v":433.07499999999999},1.6000000000000227,{"$f":"Data!G120","v":434.67500000000001},{"$f":"Data!L120","v":"EA"},{"$f":"Data!M120","v":110.9},{"$f":"IF(Data!Q120=\"NOT OPERATIONAL\",\"X\",IF(Data!Q120=\"OPERATIONAL\",\"W\",\"R\"))","v":"W"},{"$f":"Data!N120","v":"A FU "},null,null,null,null,439.76249999999999]
[null,{"$f":"Data!K121","v":"HASTINGS"},{"$f":"Data!D121","v":"GB3ES"},{"$f":"Data!F121","v":145.67500000000001},-0.60000000000002274,{"$f":"Data!G121","v":145.07499999999999},{"$f":"Data!L121","v":"SE"},{"$f":"Data!M121","v":103.5},{"$f":"IF(Data!Q121=\"NOT OPERATIONAL\",\"X\",IF(Data!Q121=\"OPERATIONAL\",\"W\",\"R\"))","v":"W"},{"$f":"Data!N121","v":"A "},null,null,null,null,439.77499999999998]
[null,{"$f":"Data!K122","v":"COLD ASHBY"},{"$f":"Data!D122","v":"GB3EU"},{"$f":"Data!F122","v":438.4375},-7.6000000000000227,{"$f":"Data!G122","v":430.83749999999998},{"$f":"Data!L122","v":"MID"},{"$f":"Data!M122","v":77},{"$f":"IF(Data!Q122=\"NOT OPERATIONAL\",\"X\",IF(Data!Q122=\"OPERATIONAL\",\"W\",\"R\"))","v":"X"},{"$f":"Data!N122","v":"A "},null,null,null,null,1290.6500000000001]
[null,{"$f":"Data!K123","v":"DUFTON"},{"$f":"Data!D123","v":"GB3EV"},{"$f":"Data!F123","v":145.69999999999999},-0.59999999999999432,{"$f":"Data!G123","v":145.1},{"$f":"Data!L123","v":"NOR"},{"$f":"Data!M123","v":77},{"$f":"IF(Data!Q123=\"NOT OPERATIONAL\",\"X\",IF(Data!Q123=\"OPERATIONAL\",\"W\",\"R\"))","v":"W"},{"$f":"Data!N123","v":"A "},null,null,null,null,1297]
[null,{"$f":"Data!K124","v":"EXETER"},{"$f":"Data!D124","v":"GB3EW"},{"$f":"Data!F124","v":145.61250000000001},-0.60000000000002274,{"$f":"Data!G124","v":145.01249999999999},{"$f":"Data!L124","v":"SW"},{"$f":"Data!M124","v":77},{"$f":"IF(Data!Q124=\"NOT OPERATIONAL\",\"X\",IF(Data!Q124=\"OPERATIONAL\",\"W\",\"R\"))","v":"W"},{"$f":"Data!N124","v":"A "},null,null,null,null,1297.0250000000001]
[null,{"$f":"Data!K125","v":"SILVERTON"},{"$f":"Data!D125","v":"GB3EX"},{"$f":"Data!F125","v":430.95},7.6000000000000227,{"$f":"Data!G125","v":438.55},{"$f":"Data!L125","v":"SW"},{"$f":"Data!M125","v":77},{"$f":"IF(Data!Q125=\"NOT OPERATIONAL\",\"X\",IF(Data!Q125=\"OPERATIONAL\",\"W\",\"R\"))","v":"W"},{"$f":"Data!N125","v":"A "},null,null,null,null,1297.05]
[null,{"$f":"Data!K126","v":"BURY ST EDMUNDS "},{"$f":"Data!D126","v":"GB3EZ"},{"$f":"Data!F126","v":430.97500000000002},7.5999999999999659,{"$f":"Data!G126","v":438.57499999999999},{"$f":"Data!L126","v":"EA"},{"$f":"Data!M126","v":110.9},{"$f":"IF(Data!Q126=\"NOT OPERATIONAL\",\"X\",IF(Data!Q126=\"OPERATIONAL\",\"W\",\"R\"))","v":"W"},{"$f":"Data!N126","v":"A "},null,null,null,null,1297.075]
[null,{"$f":"Data!K127","v":"SHEFFIELD"},{"$f":"Data!D127","v":"GB3FA"},{"$f":"Data!F127","v":145.71250000000001},-0.59999999999999432,{"$f":"Data!G127","v":145.11250000000001},{"$f":"Data!L127","v":"NOR"},{"$f":"Data!M127","v":82.5},{"$f":"IF(Data!Q127=\"NOT OPERATIONAL\",\"X\",IF(Data!Q127=\"OPERATIONAL\",\"W\",\"R\"))","v":"W"},{"$f":"Data!N127","v":"A "},null,null,null,null,1297.0999999999999]
[null,{"$f":"Data!K128","v":"BLACKPOOL"},{"$f":"Data!D128","v":"GB3FC"},{"$f":"Data!F128","v":430.85},7.5999999999999659,{"$f":"Data!G128","v":438.45},{"$f":"Data!L128","v":"NOR"},{"$f":"Data!M128","v":82.5},{"$f":"IF(Data!Q128=\"NOT OPERATIONAL\",\"X\",IF(Data!Q128=\"OPERATIONAL\",\"W\",\"R\"))","v":"W"},{"$f":"Data!N128","v":"A "},null,null,null,null,1297.1500000000001]
[null,{"$f":"Data!K129","v":"STIRLING"},{"$f":"Data!D129","v":"GB3FE"},{"$f":"Data!F129","v":145.66249999999999},-0.59999999999999432,{"$f":"Data!G129","v":145.0625},{"$f":"Data!L129","v":"SCO"},{"$f":"Data!M129","v":103.5},{"$f":"IF(Data!Q129=\"NOT OPERATIONAL\",\"X\",IF(Data!Q129=\"OPERATIONAL\",\"W\",\"R\"))","v":"W"},{"$f":"Data!N129","v":"A "},null,null,null,null,1297.3]
[null,{"$f":"Data!K130","v":"UPPER LARGO"},{"$f":"Data!D130","v":"GB3FF"},{"$f":"Data!F130","v":145.6},-0.59999999999999432,{"$f":"Data!G130","v":145},{"$f":"Data!L130","v":"SCO"},{"$f":"Data!M130","v":103.5},{"$f":"IF(Data!Q130=\"NOT OPERATIONAL\",\"X\",IF(Data!Q130=\"OPERATIONAL\",\"W\",\"R\"))","v":"X"},{"$f":"Data!N130","v":"A "},null,null,null,null,1297.3499999999999]
[null,{"$f":"Data!K131","v":"CARMARTHEN"},{"$f":"Data!D131","v":"GB3FG"},{"$f":"Data!F131","v":145.71250000000001},-0.59999999999999432,{"$f":"Data!G131","v":145.11250000000001},{"$f":"Data!L131","v":"WM"},{"$f":"Data!M131","v":94.8},{"$f":"IF(Data!Q131=\"NOT OPERATIONAL\",\"X\",IF(Data!Q131=\"OPERATIONAL\",\"W\",\"R\"))","v":"W"},{"$f":"Data!N131","v":"A FU "},null,null,null,null,1297.375]
[null,{"$f":"Data!K132","v":"SOMERSET"},{"$f":"Data!D132","v":"GB3FH"},{"$f":"Data!F132","v":50.77},0.5,{"$f":"Data!G132","v":51.27},{"$f":"Data!L132","v":"SW"},{"$f":"Data!M132","v":77},{"$f":"IF(Data!Q132=\"NOT OPERATIONAL\",\"X\",IF(Data!Q132=\"OPERATIONAL\",\"W\",\"R\"))","v":"W"},{"$f":"Data!N132","v":"A "}]
[null,{"$f":"Data!K133","v":"CHEDDAR"},{"$f":"Data!D133","v":"GB3FI"},{"$f":"Data!F133","v":430.92500000000001},7.5999999999999659,{"$f":"Data!G133","v":438.52499999999998},{"$f":"Data!L133","v":"SW"},{"$f":"Data!M133","v":77},{"$f":"IF(Data!Q133=\"NOT OPERATIONAL\",\"X\",IF(Data!Q133=\"OPERATIONAL\",\"W\",\"R\"))","v":"W"},{"$f":"Data!N133","v":"A "}]
[null,{"$f":"Data!K134","v":"FOLKESTONE"},{"$f":"Data!D134","v":"GB3FK"},{"$f":"Data!F134","v":145.75},-0.59999999999999432,{"$f":"Data!G134","v":145.15},{"$f":"Data!L134","v":"SE"},{"$f":"Data!M134","v":103.5},{"$f":"IF(Data!Q134=\"NOT OPERATIONAL\",\"X\",IF(Data!Q134=\"OPERATIONAL\",\"W\",\"R\"))","v":"X"},{"$f":"Data!N134","v":"A FU "}]
[null,{"$f":"Data!K135","v":"FARNHAM"},{"$f":"Data!D135","v":"GB3FN"},{"$f":"Data!F135","v":433.375},1.6000000000000227,{"$f":"Data!G135","v":434.97500000000002},{"$f":"Data!L135","v":"SW"},{"$f":"Data!M135","v":82.5},{"$f":"IF(Data!Q135=\"NOT OPERATIONAL\",\"X\",IF(Data!Q135=\"OPERATIONAL\",\"W\",\"R\"))","v":"W"},{"$f":"Data!N135","v":"A "}]
[null,{"$f":"Data!K136","v":"BLACKPOOL"},{"$f":"Data!D136","v":"GB3FO"},{"$f":"Data!F136","v":430.25},9,{"$f":"Data!G136","v":439.25},{"$f":"Data!L136","v":"NOR"},{"$f":"Data!M136","v":82.5},{"$f":"IF(Data!Q136=\"NOT OPERATIONAL\",\"X\",IF(Data!Q136=\"OPERATIONAL\",\"W\",\"R\"))","v":"W"},{"$f":"Data!N136","v":"A "}]
[null,{"$f":"Data!K137","v":"SPILSBY LINCS."},{"$f":"Data!D137","v":"GB3FR"},{"$f":"Data!F137","v":145.77500000000001},{"$f":"F137-D137","v":-0.59999999999999432},{"$f":"Data!G137","v":145.17500000000001},{"$f":"Data!L137","v":"EA"},{"$f":"Data!M137","v":71.900000000000006},{"$f":"IF(Data!Q137=\"NOT OPERATIONAL\",\"X\",IF(Data!Q137=\"OPERATIONAL\",\"W\",\"R\"))","v":"W"},{"$f":"Data!N137","v":"A "}]
[null,{"$f":"Data!K138","v":"NOTTINGHAM"},{"$f":"Data!D138","v":"GB3FU"},{"$f":"Data!F138","v":145.75},-0.59999999999999432,{"$f":"Data!G138","v":145.15},{"$f":"Data!L138","v":"MID"},{"$f":"Data!M138","v":71.900000000000006},{"$f":"IF(Data!Q138=\"NOT OPERATIONAL\",\"X\",IF(Data!Q138=\"OPERATIONAL\",\"W\",\"R\"))","v":"R"},{"$f":"Data!N138","v":"A "}]
[null,{"$f":"Data!K139","v":"STIRLING"},{"$f":"Data!D139","v":"GB3FV"},{"$f":"Data!F139","v":430.8125},7.6000000000000227,{"$f":"Data!G139","v":438.41250000000002},{"$f":"Data!L139","v":"SCO"},{"$f":"Data!M139","v":88.5},{"$f":"IF(Data!Q139=\"NOT OPERATIONAL\",\"X\",IF(Data!Q139=\"OPERATIONAL\",\"W\",\"R\"))","v":"W"},{"$f":"Data!N139","v":"A DM DS FU "}]
[null,{"$f":"Data!K140","v":"FARNHAM"},{"$f":"Data!D140","v":"GB3FX"},{"$f":"Data!F140","v":50.81},0.5,{"$f":"Data!G140","v":51.31},{"$f":"Data!L140","v":"SW"},{"$f":"Data!M140","v":82.5},{"$f":"IF(Data!Q140=\"NOT OPERATIONAL\",\"X\",IF(Data!Q140=\"OPERATIONAL\",\"W\",\"R\"))","v":"W"},{"$f":"Data!N140","v":"A "}]
[null,{"$f":"Data!K141","v":"SUTTON COLDFIELD"},{"$f":"Data!D141","v":"GB3GB"},{"$f":"Data!F141","v":439.33749999999998},-9,{"$f":"Data!G141","v":430.33749999999998},{"$f":"Data!L141","v":"MID"},{"$f":"Data!M141","v":67},{"$f":"IF(Data!Q141=\"NOT OPERATIONAL\",\"X\",IF(Data!Q141=\"OPERATIONAL\",\"W\",\"R\"))","v":"R"},{"$f":"Data!N141","v":"A "}]
[null,{"$f":"Data!K142","v":"NORTHLEACH"},{"$f":"Data!D142","v":"GB3GC"},{"$f":"Data!F142","v":50.75},0.5,{"$f":"Data!G142","v":51.25},{"$f":"Data!L142","v":"SW"},{"$f":"Data!M142","v":77},{"$f":"IF(Data!Q142=\"NOT OPERATIONAL\",\"X\",IF(Data!Q142=\"OPERATIONAL\",\"W\",\"R\"))","v":"X"},{"$f":"Data!N142","v":"A "}]
[null,{"$f":"Data!K143","v":"SNAEFELL IOM"},{"$f":"Data!D143","v":"GB3GD"},{"$f":"Data!F143","v":145.625},-0.59999999999999432,{"$f":"Data!G143","v":145.02500000000001},{"$f":"Data!L143","v":"NOR"},{"$f":"Data!M143","v":110.9},{"$f":"IF(Data!Q143=\"NOT OPERATIONAL\",\"X\",IF(Data!Q143=\"OPERATIONAL\",\"W\",\"R\"))","v":"W"},{"$f":"Data!N143","v":"A "}]
[null,{"$f":"Data!K144","v":"GUILDFORD"},{"$f":"Data!D144","v":"GB3GF"},{"$f":"Data!F144","v":433.3},1.5999999999999659,{"$f":"Data!G144","v":434.9},{"$f":"Data!L144","v":"SW"},{"$f":"Data!M144","v":88.5},{"$f":"IF(Data!Q144=\"NOT OPERATIONAL\",\"X\",IF(Data!Q144=\"OPERATIONAL\",\"W\",\"R\"))","v":"W"},{"$f":"Data!N144","v":"A "}]
[null,{"$f":"Data!K145","v":"GLOUCESTER"},{"$f":"Data!D145","v":"GB3GH"},{"$f":"Data!F145","v":433.125},1.6000000000000227,{"$f":"Data!G145","v":434.72500000000002},{"$f":"Data!L145","v":"SW"},{"$f":"Data!M145","v":118.8},{"$f":"IF(Data!Q145=\"NOT OPERATIONAL\",\"X\",IF(Data!Q145=\"OPERATIONAL\",\"W\",\"R\"))","v":"W"},{"$f":"Data!N145","v":"A "}]
[null,{"$f":"Data!K146","v":"ST HELIER"},{"$f":"Data!D146","v":"GB3GJ"},{"$f":"Data!F146","v":145.63749999999999},-0.59999999999999432,{"$f":"Data!G146","v":145.03749999999999},{"$f":"Data!L146","v":"SW"},{"$f":"Data!M146","v":71.900000000000006},{"$f":"IF(Data!Q146=\"NOT OPERATIONAL\",\"X\",IF(Data!Q146=\"OPERATIONAL\",\"W\",\"R\"))","v":"W"},{"$f":"Data!N146","v":"A "}]
[null,{"$f":"Data!K147","v":"GLASGOW"},{"$f":"Data!D147","v":"GB3GL"},{"$f":"Data!F147","v":430.9},7.6000000000000227,{"$f":"Data!G147","v":438.5},{"$f":"Data!L147","v":"SCO"},{"$f":"Data!M147","v":103.5},{"$f":"IF(Data!Q147=\"NOT OPERATIONAL\",\"X\",IF(Data!Q147=\"OPERATIONAL\",\"W\",\"R\"))","v":"W"},{"$f":"Data!N147","v":"A FU "}]
[null,{"$f":"Data!K148","v":"GREAT MALVERN"},{"$f":"Data!D148","v":"GB3GM"},{"$f":"Data!F148","v":145.625},-0.59999999999999432,{"$f":"Data!G148","v":145.02500000000001},{"$f":"Data!L148","v":"MID"},{"$f":"Data!M148","v":67},{"$f":"IF(Data!Q148=\"NOT OPERATIONAL\",\"X\",IF(Data!Q148=\"OPERATIONAL\",\"W\",\"R\"))","v":"W"},{"$f":"Data!N148","v":"FU "}]
[null,{"$f":"Data!K149","v":"BANCHORY"},{"$f":"Data!D149","v":"GB3GN"},{"$f":"Data!F149","v":145.77500000000001},-0.59999999999999432,{"$f":"Data!G149","v":145.17500000000001},{"$f":"Data!L149","v":"SCO"},{"$f":"Data!M149","v":67},{"$f":"IF(Data!Q149=\"NOT OPERATIONAL\",\"X\",IF(Data!Q149=\"OPERATIONAL\",\"W\",\"R\"))","v":"W"},{"$f":"Data!N149","v":"A "}]
[null,{"$f":"Data!K150","v":"LLANDUDNO"},{"$f":"Data!D150","v":"GB3GO"},{"$f":"Data!F150","v":145.78749999999999},-0.59999999999999432,{"$f":"Data!G150","v":145.1875},{"$f":"Data!L150","v":"WM"},{"$f":"Data!M150","v":110.9},{"$f":"IF(Data!Q150=\"NOT OPERATIONAL\",\"X\",IF(Data!Q150=\"OPERATIONAL\",\"W\",\"R\"))","v":"X"},{"$f":"Data!N150","v":"A FU "}]
[null,{"$f":"Data!K151","v":"GRANTHAM"},{"$f":"Data!D151","v":"GB3GR"},{"$f":"Data!F151","v":430.85},7.5999999999999659,{"$f":"Data!G151","v":438.45},{"$f":"Data!L151","v":"MID"},{"$f":"Data!M151","v":71.900000000000006},{"$f":"IF(Data!Q151=\"NOT OPERATIONAL\",\"X\",IF(Data!Q151=\"OPERATIONAL\",\"W\",\"R\"))","v":"W"},{"$f":"Data!N151","v":"A "}]
[null,{"$f":"Data!K152","v":"GUERNSEY"},{"$f":"Data!D152","v":"GB3GU"},{"$f":"Data!F152","v":433.32499999999999},1.6000000000000227,{"$f":"Data!G152","v":434.92500000000001},{"$f":"Data!L152","v":"SW"},{"$f":"Data!M152","v":71.900000000000006},{"$f":"IF(Data!Q152=\"NOT OPERATIONAL\",\"X\",IF(Data!Q152=\"OPERATIONAL\",\"W\",\"R\"))","v":"W"},{"$f":"Data!N152","v":"A "}]
[null,{"$f":"Data!K153","v":"HEXHAM"},{"$f":"Data!D153","v":"GB3HA"},{"$f":"Data!F153","v":145.75},-0.59999999999999432,{"$f":"Data!G153","v":145.15},{"$f":"Data!L153","v":"NOR"},{"$f":"Data!M153","v":118.8},{"$f":"IF(Data!Q153=\"NOT OPERATIONAL\",\"X\",IF(Data!Q153=\"OPERATIONAL\",\"W\",\"R\"))","v":"W"},{"$f":"Data!N153","v":"A FU "}]
[null,{"$f":"Data!K154","v":"ROCHE"},{"$f":"Data!D154","v":"GB3HB"},{"$f":"Data!F154","v":433.375},1.6000000000000227,{"$f":"Data!G154","v":434.97500000000002},{"$f":"Data!L154","v":"SW"},{"$f":"Data!M154","v":77},{"$f":"IF(Data!Q154=\"NOT OPERATIONAL\",\"X\",IF(Data!Q154=\"OPERATIONAL\",\"W\",\"R\"))","v":"X"},{"$f":"Data!N154","v":"A FU "}]
[null,{"$f":"Data!K155","v":"HEREFORD"},{"$f":"Data!D155","v":"GB3HC"},{"$f":"Data!F155","v":433.15},1.6000000000000227,{"$f":"Data!G155","v":434.75},{"$f":"Data!L155","v":"MID"},{"$f":"Data!M155","v":118.8},{"$f":"IF(Data!Q155=\"NOT OPERATIONAL\",\"X\",IF(Data!Q155=\"OPERATIONAL\",\"W\",\"R\"))","v":"X"},{"$f":"Data!N155","v":"A FU "}]
[null,{"$f":"Data!K156","v":"HUDDERSFIELD"},{"$f":"Data!D156","v":"GB3HD"},{"$f":"Data!F156","v":433.22500000000002},1.5999999999999659,{"$f":"Data!G156","v":434.82499999999999},{"$f":"Data!L156","v":"NOR"},{"$f":"Data!M156","v":82.5},{"$f":"IF(Data!Q156=\"NOT OPERATIONAL\",\"X\",IF(Data!Q156=\"OPERATIONAL\",\"W\",\"R\"))","v":"W"},{"$f":"Data!N156","v":"A FU "}]
[null,{"$f":"Data!K157","v":"HASTINGS"},{"$f":"Data!D157","v":"GB3HE"},{"$f":"Data!F157","v":430.92500000000001},7.5999999999999659,{"$f":"Data!G157","v":438.52499999999998},{"$f":"Data!L157","v":"SE"},{"$f":"Data!M157","v":103.5},{"$f":"IF(Data!Q157=\"NOT OPERATIONAL\",\"X\",IF(Data!Q157=\"OPERATIONAL\",\"W\",\"R\"))","v":"W"},{"$f":"Data!N157","v":"A FU "}]
[null,{"$f":"Data!K158","v":"LLANGOLLEN"},{"$f":"Data!D158","v":"GB3HF"},{"$f":"Data!F158","v":29.69},-0.10000000000000142,{"$f":"Data!G158","v":29.59},{"$f":"Data!L158","v":"WM"},{"$f":"Data!M158","v":103.5},{"$f":"IF(Data!Q158=\"NOT OPERATIONAL\",\"X\",IF(Data!Q158=\"OPERATIONAL\",\"W\",\"R\"))","v":"X"},{"$f":"Data!N158","v":"A "}]
[null,{"$f":"Data!K159","v":"THIRSK"},{"$f":"Data!D159","v":"GB3HG"},{"$f":"Data!F159","v":145.625},-0.59999999999999432,{"$f":"Data!G159","v":145.02500000000001},{"$f":"Data!L159","v":"NOR"},{"$f":"Data!M159","v":88.5},{"$f":"IF(Data!Q159=\"NOT OPERATIONAL\",\"X\",IF(Data!Q159=\"OPERATIONAL\",\"W\",\"R\"))","v":"W"},{"$f":"Data!N159","v":"A FU "}]
[null,{"$f":"Data!K160","v":"BUXTON"},{"$f":"Data!D160","v":"GB3HH"},{"$f":"Data!F160","v":145.69999999999999},-0.59999999999999432,{"$f":"Data!G160","v":145.1},{"$f":"Data!L160","v":"MID"},{"$f":"Data!M160","v":71.900000000000006},{"$f":"IF(Data!Q160=\"NOT OPERATIONAL\",\"X\",IF(Data!Q160=\"OPERATIONAL\",\"W\",\"R\"))","v":"W"},{"$f":"Data!N160","v":"A "}]
[null,{"$f":"Data!K161","v":"ISLE OF MULL"},{"$f":"Data!D161","v":"GB3HI"},{"$f":"Data!F161","v":145.69999999999999},-0.59999999999999432,{"$f":"Data!G161","v":145.1},{"$f":"Data!L161","v":"SCO"},{"$f":"Data!M161","v":103.5},{"$f":"IF(Data!Q161=\"NOT OPERATIONAL\",\"X\",IF(Data!Q161=\"OPERATIONAL\",\"W\",\"R\"))","v":"W"},{"$f":"Data!N161","v":"A "}]
[null,{"$f":"Data!K162","v":"HARROGATE"},{"$f":"Data!D162","v":"GB3HJ"},{"$f":"Data!F162","v":433.02499999999998},1.6000000000000227,{"$f":"Data!G162","v":434.625},{"$f":"Data!L162","v":"NOR"},{"$f":"Data!M162","v":118.8},{"$f":"IF(Data!Q162=\"NOT OPERATIONAL\",\"X\",IF(Data!Q162=\"OPERATIONAL\",\"W\",\"R\"))","v":"W"},{"$f":"Data!N162","v":"A "}]
[null,{"$f":"Data!K163","v":"SELKIRK"},{"$f":"Data!D163","v":"GB3HK"},{"$f":"Data!F163","v":433.05},1.5999999999999659,{"$f":"Data!G163","v":434.65},{"$f":"Data!L163","v":"SCO"},{"$f":"Data!M163","v":118.8},{"$f":"IF(Data!Q163=\"NOT OPERATIONAL\",\"X\",IF(Data!Q163=\"OPERATIONAL\",\"W\",\"R\"))","v":"R"},{"$f":"Data!N163","v":"A "}]
[null,{"$f":"Data!K164","v":"LESLIE"},{"$f":"Data!D164","v":"GB3HL"},{"$f":"Data!F164","v":430.88749999999999},7.6000000000000227,{"$f":"Data!G164","v":438.48750000000001},{"$f":"Data!L164","v":"SCO"},{"$f":"Data!M164","v":67},{"$f":"IF(Data!Q164=\"NOT OPERATIONAL\",\"X\",IF(Data!Q164=\"OPERATIONAL\",\"W\",\"R\"))","v":"W"},{"$f":"Data!N164","v":"A DM "}]
[null,{"$f":"Data!K165","v":"BELPER"},{"$f":"Data!D165","v":"GB3HM"},{"$f":"Data!F165","v":50.82},0.5,{"$f":"Data!G165","v":51.32},{"$f":"Data!L165","v":"MID"},{"$f":"Data!M165","v":71.900000000000006},{"$f":"IF(Data!Q165=\"NOT OPERATIONAL\",\"X\",IF(Data!Q165=\"OPERATIONAL\",\"W\",\"R\"))","v":"W"},{"$f":"Data!N165","v":"A "}]
[null,{"$f":"Data!K166","v":"LUDLOW"},{"$f":"Data!D166","v":"GB3HN"},{"$f":"Data!F166","v":439.6},-9,{"$f":"Data!G166","v":430.6},{"$f":"Data!L166","v":"MID"},{"$f":"Data!M166","v":103.5},{"$f":"IF(Data!Q166=\"NOT OPERATIONAL\",\"X\",IF(Data!Q166=\"OPERATIONAL\",\"W\",\"R\"))","v":"W"},{"$f":"Data!N166","v":"A "}]
[null,{"$f":"Data!K167","v":"HORSHAM"},{"$f":"Data!D167","v":"GB3HO"},{"$f":"Data!F167","v":430.88749999999999},7.6000000000000227,{"$f":"Data!G167","v":438.48750000000001},{"$f":"Data!L167","v":"SE"},{"$f":"Data!M167","v":88.5},{"$f":"IF(Data!Q167=\"NOT OPERATIONAL\",\"X\",IF(Data!Q167=\"OPERATIONAL\",\"W\",\"R\"))","v":"W"},{"$f":"Data!N167","v":"A "}]
[null,{"$f":"Data!K168","v":"HOOTON  WIRRAL"},{"$f":"Data!D168","v":"GB3HP"},{"$f":"Data!F168","v":439.32499999999999},-9,{"$f":"Data!G168","v":430.32499999999999},{"$f":"Data!L168","v":"MID"},{"$f":"Data!M168","v":67},{"$f":"IF(Data!Q168=\"NOT OPERATIONAL\",\"X\",IF(Data!Q168=\"OPERATIONAL\",\"W\",\"R\"))","v":"W"},{"$f":"Data!N168","v":"A "}]
[null,{"$f":"Data!K169","v":"HARROW"},{"$f":"Data!D169","v":"GB3HR"},{"$f":"Data!F169","v":433.35},1.5999999999999659,{"$f":"Data!G169","v":434.95},{"$f":"Data!L169","v":"SE"},{"$f":"Data!M169","v":82.5},{"$f":"IF(Data!Q169=\"NOT OPERATIONAL\",\"X\",IF(Data!Q169=\"OPERATIONAL\",\"W\",\"R\"))","v":"W"},{"$f":"Data!N169","v":"A "}]
[null,{"$f":"Data!K170","v":"HULL"},{"$f":"Data!D170","v":"GB3HS"},{"$f":"Data!F170","v":145.65},-0.59999999999999432,{"$f":"Data!G170","v":145.05000000000001},{"$f":"Data!L170","v":"NOR"},{"$f":"Data!M170","v":88.5},{"$f":"IF(Data!Q170=\"NOT OPERATIONAL\",\"X\",IF(Data!Q170=\"OPERATIONAL\",\"W\",\"R\"))","v":"W"},{"$f":"Data!N170","v":"A DS FU "}]
[null,{"$f":"Data!K171","v":"HINCKLEY"},{"$f":"Data!D171","v":"GB3HT"},{"$f":"Data!F171","v":433.27499999999998},1.6000000000000227,{"$f":"Data!G171","v":434.875},{"$f":"Data!L171","v":"MID"},{"$f":"Data!M171","v":77},{"$f":"IF(Data!Q171=\"NOT OPERATIONAL\",\"X\",IF(Data!Q171=\"OPERATIONAL\",\"W\",\"R\"))","v":"W"},{"$f":"Data!N171","v":"A "}]
[null,{"$f":"Data!K172","v":"HUDDERSFIELD"},{"$f":"Data!D172","v":"GB3HU"},{"$f":"Data!F172","v":145.6},-0.59999999999999432,{"$f":"Data!G172","v":145},{"$f":"Data!L172","v":"NOR"},{"$f":"Data!M172","v":82.5},{"$f":"IF(Data!Q172=\"NOT OPERATIONAL\",\"X\",IF(Data!Q172=\"OPERATIONAL\",\"W\",\"R\"))","v":"W"},{"$f":"Data!N172","v":"A "}]
[null,{"$f":"Data!K173","v":"GIDEA PARK"},{"$f":"Data!D173","v":"GB3HW"},{"$f":"Data!F173","v":433.32499999999999},1.6000000000000227,{"$f":"Data!G173","v":434.92500000000001},{"$f":"Data!L173","v":"SE"},{"$f":"Data!M173","v":110.9},{"$f":"IF(Data!Q173=\"NOT OPERATIONAL\",\"X\",IF(Data!Q173=\"OPERATIONAL\",\"W\",\"R\"))","v":"W"},{"$f":"Data!N173","v":"A "}]
[null,{"$f":"Data!K174","v":"HAYWARDS HEATH"},{"$f":"Data!D174","v":"GB3HY"},{"$f":"Data!F174","v":430.9},7.6000000000000227,{"$f":"Data!G174","v":438.5},{"$f":"Data!L174","v":"SE"},{"$f":"Data!M174","v":88.5},{"$f":"IF(Data!Q174=\"NOT OPERATIONAL\",\"X\",IF(Data!Q174=\"OPERATIONAL\",\"W\",\"R\"))","v":"W"},{"$f":"Data!N174","v":"A "}]
[null,{"$f":"Data!K175","v":"WOLVERHAMPTON"},{"$f":"Data!D175","v":"GB3IC"},{"$f":"Data!F175","v":433.125},1.6000000000000227,{"$f":"Data!G175","v":434.72500000000002},{"$f":"Data!L175","v":"MID"},{"$f":"Data!M175","v":67},{"$f":"IF(Data!Q175=\"NOT OPERATIONAL\",\"X\",IF(Data!Q175=\"OPERATIONAL\",\"W\",\"R\"))","v":"W"},{"$f":"Data!N175","v":"A FU "}]
[null,{"$f":"Data!K176","v":"STORNOWAY"},{"$f":"Data!D176","v":"GB3IG"},{"$f":"Data!F176","v":145.77500000000001},-0.59999999999999432,{"$f":"Data!G176","v":145.17500000000001},{"$f":"Data!L176","v":"SCO"},{"$f":"Data!M176","v":88.5},{"$f":"IF(Data!Q176=\"NOT OPERATIONAL\",\"X\",IF(Data!Q176=\"OPERATIONAL\",\"W\",\"R\"))","v":"W"},{"$f":"Data!N176","v":"A "}]
[null,{"$f":"Data!K177","v":"IPSWICH"},{"$f":"Data!D177","v":"GB3IH"},{"$f":"Data!F177","v":433.1},1.5999999999999659,{"$f":"Data!G177","v":434.7},{"$f":"Data!L177","v":"EA"},{"$f":"Data!M177","v":110.9},{"$f":"IF(Data!Q177=\"NOT OPERATIONAL\",\"X\",IF(Data!Q177=\"OPERATIONAL\",\"W\",\"R\"))","v":"W"},{"$f":"Data!N177","v":"A "}]
[null,{"$f":"Data!K178","v":"NR EYE"},{"$f":"Data!D178","v":"GB3II"},{"$f":"Data!F178","v":145.69999999999999},-0.59999999999999432,{"$f":"Data!G178","v":145.1},{"$f":"Data!L178","v":"EA"},{"$f":"Data!M178","v":110.9},{"$f":"IF(Data!Q178=\"NOT OPERATIONAL\",\"X\",IF(Data!Q178=\"OPERATIONAL\",\"W\",\"R\"))","v":"W"},{"$f":"Data!N178","v":"A "}]
[null,{"$f":"Data!K179","v":"ROCHESTER"},{"$f":"Data!D179","v":"GB3IK"},{"$f":"Data!F179","v":145.76249999999999},-0.59999999999999432,{"$f":"Data!G179","v":145.16249999999999},{"$f":"Data!L179","v":"SE"},{"$f":"Data!M179","v":103.5},{"$f":"IF(Data!Q179=\"NOT OPERATIONAL\",\"X\",IF(Data!Q179=\"OPERATIONAL\",\"W\",\"R\"))","v":"W"},{"$f":"Data!N179","v":"A "}]
[null,{"$f":"Data!K180","v":"DOUGLAS  IOM"},{"$f":"Data!D180","v":"GB3IM-C"},{"$f":"Data!F180","v":430.82499999999999},7.6000000000000227,{"$f":"Data!G180","v":438.42500000000001},{"$f":"Data!L180","v":"NOR"},{"$f":"Data!M180","v":110.9},{"$f":"IF(Data!Q180=\"NOT OPERATIONAL\",\"X\",IF(Data!Q180=\"OPERATIONAL\",\"W\",\"R\"))","v":"W"},{"$f":"Data!N180","v":"A "}]
[null,{"$f":"Data!K181","v":"PEEL"},{"$f":"Data!D181","v":"GB3IM-P"},{"$f":"Data!F181","v":430.875},7.6000000000000227,{"$f":"Data!G181","v":438.47500000000002},{"$f":"Data!L181","v":"NOR"},{"$f":"Data!M181","v":110.9},{"$f":"IF(Data!Q181=\"NOT OPERATIONAL\",\"X\",IF(Data!Q181=\"OPERATIONAL\",\"W\",\"R\"))","v":"W"},{"$f":"Data!N181","v":"A "}]
[null,{"$f":"Data!K182","v":"RAMSEY  IOM"},{"$f":"Data!D182","v":"GB3IM-R"},{"$f":"Data!F182","v":430.82499999999999},7.6000000000000227,{"$f":"Data!G182","v":438.42500000000001},{"$f":"Data!L182","v":"NOR"},{"$f":"Data!M182","v":71.900000000000006},{"$f":"IF(Data!Q182=\"NOT OPERATIONAL\",\"X\",IF(Data!Q182=\"OPERATIONAL\",\"W\",\"R\"))","v":"W"},{"$f":"Data!N182","v":"A "}]
[null,{"$f":"Data!K183","v":"DOUGLAS  IOM"},{"$f":"Data!D183","v":"GB3IM-S"},{"$f":"Data!F183","v":433.125},1.6000000000000227,{"$f":"Data!G183","v":434.72500000000002},{"$f":"Data!L183","v":"NOR"},{"$f":"Data!M183","v":110.9},{"$f":"IF(Data!Q183=\"NOT OPERATIONAL\",\"X\",IF(Data!Q183=\"OPERATIONAL\",\"W\",\"R\"))","v":"W"},{"$f":"Data!N183","v":"A "}]
[null,{"$f":"Data!K184","v":"TANSLEY NR MATLOCK"},{"$f":"Data!D184","v":"GB3IN"},{"$f":"Data!F184","v":145.63749999999999},-0.59999999999999432,{"$f":"Data!G184","v":145.03749999999999},{"$f":"Data!L184","v":"MID"},{"$f":"Data!M184","v":71.900000000000006},{"$f":"IF(Data!Q184=\"NOT OPERATIONAL\",\"X\",IF(Data!Q184=\"OPERATIONAL\",\"W\",\"R\"))","v":"W"},{"$f":"Data!N184","v":"A DM DS FU NX "}]
[null,{"$f":"Data!K185","v":"LONG ASHTON  BRISTOL"},{"$f":"Data!D185","v":"GB3IP"},{"$f":"Data!F185","v":430.875},7.6000000000000227,{"$f":"Data!G185","v":438.47500000000002},{"$f":"Data!L185","v":"SW"},{"$f":"Data!M185","v":118.8},{"$f":"IF(Data!Q185=\"NOT OPERATIONAL\",\"X\",IF(Data!Q185=\"OPERATIONAL\",\"W\",\"R\"))","v":"W"},{"$f":"Data!N185","v":"A DM "}]
[null,{"$f":"Data!K186","v":"RICHMOND YORKS"},{"$f":"Data!D186","v":"GB3IR"},{"$f":"Data!F186","v":145.76249999999999},-0.59999999999999432,{"$f":"Data!G186","v":145.16249999999999},{"$f":"Data!L186","v":"NOR"},{"$f":"Data!M186","v":88.5},{"$f":"IF(Data!Q186=\"NOT OPERATIONAL\",\"X\",IF(Data!Q186=\"OPERATIONAL\",\"W\",\"R\"))","v":"W"},{"$f":"Data!N186","v":"A "}]
[null,{"$f":"Data!K187","v":"ISLE OF SOUTH UIST"},{"$f":"Data!D187","v":"GB3IS"},{"$f":"Data!F187","v":430.88749999999999},7.6000000000000227,{"$f":"Data!G187","v":438.48750000000001},{"$f":"Data!L187","v":"SCO"},{"$f":"Data!M187","v":94.8},{"$f":"IF(Data!Q187=\"NOT OPERATIONAL\",\"X\",IF(Data!Q187=\"OPERATIONAL\",\"W\",\"R\"))","v":"W"},{"$f":"Data!N187","v":"A DM DS FU "}]
[null,{"$f":"Data!K188","v":"NEWPORT"},{"$f":"Data!D188","v":"GB3IW"},{"$f":"Data!F188","v":433.22500000000002},1.5999999999999659,{"$f":"Data!G188","v":434.82499999999999},{"$f":"Data!L188","v":"SW"},{"$f":"Data!M188","v":71.900000000000006},{"$f":"IF(Data!Q188=\"NOT OPERATIONAL\",\"X\",IF(Data!Q188=\"OPERATIONAL\",\"W\",\"R\"))","v":"W"},{"$f":"Data!N188","v":"A FU "}]
[null,{"$f":"Data!K189","v":"MERE WILTSHIRE"},{"$f":"Data!D189","v":"GB3JB"},{"$f":"Data!F189","v":145.78749999999999},-0.59999999999999432,{"$f":"Data!G189","v":145.1875},{"$f":"Data!L189","v":"SW"},{"$f":"Data!M189","v":103.5},{"$f":"IF(Data!Q189=\"NOT OPERATIONAL\",\"X\",IF(Data!Q189=\"OPERATIONAL\",\"W\",\"R\"))","v":"W"},{"$f":"Data!N189","v":"A DM "}]
[null,{"$f":"Data!K190","v":"WEYMOUTH"},{"$f":"Data!D190","v":"GB3JG"},{"$f":"Data!F190","v":439.77499999999998},-9,{"$f":"Data!G190","v":430.77499999999998},{"$f":"Data!L190","v":"SW"},{"$f":"Data!M190","v":71.900000000000006},{"$f":"IF(Data!Q190=\"NOT OPERATIONAL\",\"X\",IF(Data!Q190=\"OPERATIONAL\",\"W\",\"R\"))","v":"W"},{"$f":"Data!N190","v":"A FU "}]
[null,{"$f":"Data!K191","v":"TIVERTON"},{"$f":"Data!D191","v":"GB3JH"},{"$f":"Data!F191","v":430.86250000000001},7.5999999999999659,{"$f":"Data!G191","v":438.46249999999998},{"$f":"Data!L191","v":"SW"},{"$f":"Data!M191","v":77},{"$f":"IF(Data!Q191=\"NOT OPERATIONAL\",\"X\",IF(Data!Q191=\"OPERATIONAL\",\"W\",\"R\"))","v":"W"},{"$f":"Data!N191","v":"A DM "}]
[null,{"$f":"Data!K192","v":"LISKEARD"},{"$f":"Data!D192","v":"GB3JL"},{"$f":"Data!F192","v":145.78749999999999},-0.59999999999999432,{"$f":"Data!G192","v":145.1875},{"$f":"Data!L192","v":"SW"},{"$f":"Data!M192","v":77},{"$f":"IF(Data!Q192=\"NOT OPERATIONAL\",\"X\",IF(Data!Q192=\"OPERATIONAL\",\"W\",\"R\"))","v":"W"},{"$f":"Data!N192","v":"A "}]
[null,{"$f":"Data!K193","v":"MANSFIELD"},{"$f":"Data!D193","v":"GB3JR"},{"$f":"Data!F193","v":430.97500000000002},7.5999999999999659,{"$f":"Data!G193","v":438.57499999999999},{"$f":"Data!L193","v":"MID"},{"$f":"Data!M193","v":71.900000000000006},{"$f":"IF(Data!Q193=\"NOT OPERATIONAL\",\"X\",IF(Data!Q193=\"OPERATIONAL\",\"W\",\"R\"))","v":"W"},{"$f":"Data!N193","v":"A "}]
[null,{"$f":"Data!K194","v":"GREAT YARMOUTH "},{"$f":"Data!D194","v":"GB3JS"},{"$f":"Data!F194","v":430.83749999999998},7.6000000000000227,{"$f":"Data!G194","v":438.4375},{"$f":"Data!L194","v":"EA"},{"$f":"Data!M194","v":94.8},{"$f":"IF(Data!Q194=\"NOT OPERATIONAL\",\"X\",IF(Data!Q194=\"OPERATIONAL\",\"W\",\"R\"))","v":"W"},{"$f":"Data!N194","v":"A "}]
[null,{"$f":"Data!K195","v":"EASTLEIGH"},{"$f":"Data!D195","v":"GB3JZ"},{"$f":"Data!F195","v":430.91250000000002},7.5999999999999659,{"$f":"Data!G195","v":438.51249999999999},{"$f":"Data!L195","v":"SW"},{"$f":"Data!M195","v":71.900000000000006},{"$f":"IF(Data!Q195=\"NOT OPERATIONAL\",\"X\",IF(Data!Q195=\"OPERATIONAL\",\"W\",\"R\"))","v":"W"},{"$f":"Data!N195","v":"A "}]
[null,{"$f":"Data!K196","v":"KIDDERMINSTER"},{"$f":"Data!D196","v":"GB3KA"},{"$f":"Data!F196","v":430.88749999999999},7.6000000000000227,{"$f":"Data!G196","v":438.48750000000001},{"$f":"Data!L196","v":"MID"},{"$f":"Data!M196","v":118.8},{"$f":"IF(Data!Q196=\"NOT OPERATIONAL\",\"X\",IF(Data!Q196=\"OPERATIONAL\",\"W\",\"R\"))","v":"W"},{"$f":"Data!N196","v":"A "}]
[null,{"$f":"Data!K197","v":"ERITH"},{"$f":"Data!D197","v":"GB3KB"},{"$f":"Data!F197","v":29.69},-0.10000000000000142,{"$f":"Data!G197","v":29.59},{"$f":"Data!L197","v":"SE"},{"$f":"Data!M197","v":103.5},{"$f":"IF(Data!Q197=\"NOT OPERATIONAL\",\"X\",IF(Data!Q197=\"OPERATIONAL\",\"W\",\"R\"))","v":"X"},{"$f":"Data!N197","v":"A "}]
[null,{"$f":"Data!K198","v":"STOURBRIDGE"},{"$f":"Data!D198","v":"GB3KC"},{"$f":"Data!F198","v":430.9},7.6000000000000227,{"$f":"Data!G198","v":438.5},{"$f":"Data!L198","v":"MID"},{"$f":"Data!M198","v":67},{"$f":"IF(Data!Q198=\"NOT OPERATIONAL\",\"X\",IF(Data!Q198=\"OPERATIONAL\",\"W\",\"R\"))","v":"W"},{"$f":"Data!N198","v":"A "}]
[null,{"$f":"Data!K199","v":"KIDDERMINSTER"},{"$f":"Data!D199","v":"GB3KD"},{"$f":"Data!F199","v":145.78749999999999},-0.59999999999999432,{"$f":"Data!G199","v":145.1875},{"$f":"Data!L199","v":"MID"},{"$f":"Data!M199","v":118.8},{"$f":"IF(Data!Q199=\"NOT OPERATIONAL\",\"X\",IF(Data!Q199=\"OPERATIONAL\",\"W\",\"R\"))","v":"W"},{"$f":"Data!N199","v":"A "}]
[null,{"$f":"Data!K200","v":"GLASGOW"},{"$f":"Data!D200","v":"GB3KE"},{"$f":"Data!F200","v":145.6875},-0.59999999999999432,{"$f":"Data!G200","v":145.08750000000001},{"$f":"Data!L200","v":"SCO"},{"$f":"Data!M200","v":103.5},{"$f":"IF(Data!Q200=\"NOT OPERATIONAL\",\"X\",IF(Data!Q200=\"OPERATIONAL\",\"W\",\"R\"))","v":"W"},{"$f":"Data!N200","v":"A FU "}]
[null,{"$f":"Data!K201","v":"CHATHAM "},{"$f":"Data!D201","v":"GB3KH"},{"$f":"Data!F201","v":433.375},{"$f":"F201-D201","v":5},{"$f":"Data!G201","v":438.375},{"$f":"Data!L201","v":"SE"},{"$f":"Data!M201","v":103.5},{"$f":"IF(Data!Q201=\"NOT OPERATIONAL\",\"X\",IF(Data!Q201=\"OPERATIONAL\",\"W\",\"R\"))","v":"W"},{"$f":"Data!N201","v":"A "}]
[null,{"$f":"Data!K202","v":"HERNE BAY"},{"$f":"Data!D202","v":"GB3KI"},{"$f":"Data!F202","v":145.66249999999999},-0.59999999999999432,{"$f":"Data!G202","v":145.0625},{"$f":"Data!L202","v":"SE"},{"$f":"Data!M202","v":103.5},{"$f":"IF(Data!Q202=\"NOT OPERATIONAL\",\"X\",IF(Data!Q202=\"OPERATIONAL\",\"W\",\"R\"))","v":"W"},{"$f":"Data!N202","v":"A DS "}]
[null,{"$f":"Data!K203","v":"BALLYCASTLE"},{"$f":"Data!D203","v":"GB3KK"},{"$f":"Data!F203","v":430.97500000000002},7.5999999999999659,{"$f":"Data!G203","v":438.57499999999999},{"$f":"Data!L203","v":"NI"},{"$f":"Data!M203","v":110.9},{"$f":"IF(Data!Q203=\"NOT OPERATIONAL\",\"X\",IF(Data!Q203=\"OPERATIONAL\",\"W\",\"R\"))","v":"W"},{"$f":"Data!N203","v":"A "}]
[null,{"$f":"Data!K204","v":"KINGS LYNN"},{"$f":"Data!D204","v":"GB3KL"},{"$f":"Data!F204","v":433.1},1.5999999999999659,{"$f":"Data!G204","v":434.7},{"$f":"Data!L204","v":"EA"},{"$f":"Data!M204","v":94.8},{"$f":"IF(Data!Q204=\"NOT OPERATIONAL\",\"X\",IF(Data!Q204=\"OPERATIONAL\",\"W\",\"R\"))","v":"W"},{"$f":"Data!N204","v":"A FU "}]
[null,{"$f":"Data!K205","v":"MAIDSTONE"},{"$f":"Data!D205","v":"GB3KN"},{"$f":"Data!F205","v":145.69999999999999},-0.59999999999999432,{"$f":"Data!G205","v":145.1},{"$f":"Data!L205","v":"SE"},{"$f":"Data!M205","v":103.5},{"$f":"IF(Data!Q205=\"NOT OPERATIONAL\",\"X\",IF(Data!Q205=\"OPERATIONAL\",\"W\",\"R\"))","v":"W"},{"$f":"Data!N205","v":"A "}]
[null,{"$f":"Data!K206","v":"STOURPORT ON SEVERN"},{"$f":"Data!D206","v":"GB3KR"},{"$f":"Data!F206","v":430.8125},7.6000000000000227,{"$f":"Data!G206","v":438.41250000000002},{"$f":"Data!L206","v":"MID"},{"$f":"Data!M206","v":118.8},{"$f":"IF(Data!Q206=\"NOT OPERATIONAL\",\"X\",IF(Data!Q206=\"OPERATIONAL\",\"W\",\"R\"))","v":"W"},{"$f":"Data!N206","v":"A "}]
[null,{"$f":"Data!K207","v":"DOVER"},{"$f":"Data!D207","v":"GB3KS"},{"$f":"Data!F207","v":145.625},-0.59999999999999432,{"$f":"Data!G207","v":145.02500000000001},{"$f":"Data!L207","v":"SE"},{"$f":"Data!M207","v":103.5},{"$f":"IF(Data!Q207=\"NOT OPERATIONAL\",\"X\",IF(Data!Q207=\"OPERATIONAL\",\"W\",\"R\"))","v":"W"},{"$f":"Data!N207","v":"A FU "}]
[null,{"$f":"Data!K208","v":"KEIGHLEY"},{"$f":"Data!D208","v":"GB3KT"},{"$f":"Data!F208","v":430.85},7.5999999999999659,{"$f":"Data!G208","v":438.45},{"$f":"Data!L208","v":"NOR"},{"$f":"Data!M208","v":74.400000000000006},{"$f":"IF(Data!Q208=\"NOT OPERATIONAL\",\"X\",IF(Data!Q208=\"OPERATIONAL\",\"W\",\"R\"))","v":"W"},{"$f":"Data!N208","v":"A "}]
[null,{"$f":"Data!K209","v":"ASHTON-UNDER-LYNE"},{"$f":"Data!D209","v":"GB3KU"},{"$f":"Data!F209","v":433.07499999999999},1.6000000000000227,{"$f":"Data!G209","v":434.67500000000001},{"$f":"Data!L209","v":"NOR"},{"$f":"Data!M209","v":82.5},{"$f":"IF(Data!Q209=\"NOT OPERATIONAL\",\"X\",IF(Data!Q209=\"OPERATIONAL\",\"W\",\"R\"))","v":"W"},{"$f":"Data!N209","v":"A DM DS FU NX "}]
[null,{"$f":"Data!K210","v":"KILSYTH"},{"$f":"Data!D210","v":"GB3KV"},{"$f":"Data!F210","v":430.97500000000002},7.5999999999999659,{"$f":"Data!G210","v":438.57499999999999},{"$f":"Data!L210","v":"SCO"},{"$f":"Data!M210","v":103.5},{"$f":"IF(Data!Q210=\"NOT OPERATIONAL\",\"X\",IF(Data!Q210=\"OPERATIONAL\",\"W\",\"R\"))","v":"W"},{"$f":"Data!N210","v":"A "}]
[null,{"$f":"Data!K211","v":"GLASGOW"},{"$f":"Data!D211","v":"GB3KW"},{"$f":"Data!F211","v":430.82499999999999},7.6000000000000227,{"$f":"Data!G211","v":438.42500000000001},{"$f":"Data!L211","v":"SCO"},{"$f":"Data!M211","v":103.5},{"$f":"IF(Data!Q211=\"NOT OPERATIONAL\",\"X\",IF(Data!Q211=\"OPERATIONAL\",\"W\",\"R\"))","v":"W"},{"$f":"Data!N211","v":"A FU "}]
[null,{"$f":"Data!K212","v":"LONDON"},{"$f":"Data!D212","v":"GB3KX"},{"$f":"Data!F212","v":430.83749999999998},7.6000000000000227,{"$f":"Data!G212","v":438.4375},{"$f":"Data!L212","v":"SE"},{"$f":"Data!M212","v":82.5},{"$f":"IF(Data!Q212=\"NOT OPERATIONAL\",\"X\",IF(Data!Q212=\"OPERATIONAL\",\"W\",\"R\"))","v":"X"},{"$f":"Data!N212","v":"A "}]
[null,{"$f":"Data!K213","v":"KINGS LYNN"},{"$f":"Data!D213","v":"GB3KY"},{"$f":"Data!F213","v":145.71250000000001},-0.59999999999999432,{"$f":"Data!G213","v":145.11250000000001},{"$f":"Data!L213","v":"EA"},{"$f":"Data!M213","v":94.8},{"$f":"IF(Data!Q213=\"NOT OPERATIONAL\",\"X\",IF(Data!Q213=\"OPERATIONAL\",\"W\",\"R\"))","v":"W"},{"$f":"Data!N213","v":"A "}]
[null,{"$f":"Data!K214","v":"SANQUHAR"},{"$f":"Data!D214","v":"GB3LA"},{"$f":"Data!F214","v":145.71250000000001},-0.59999999999999432,{"$f":"Data!G214","v":145.11250000000001},{"$f":"Data!L214","v":"SCO"},{"$f":"Data!M214","v":103.5},{"$f":"IF(Data!Q214=\"NOT OPERATIONAL\",\"X\",IF(Data!Q214=\"OPERATIONAL\",\"W\",\"R\"))","v":"W"},{"$f":"Data!N214","v":"A "}]
[null,{"$f":"Data!K215","v":"LAUDER"},{"$f":"Data!D215","v":"GB3LB"},{"$f":"Data!F215","v":145.78749999999999},-0.59999999999999432,{"$f":"Data!G215","v":145.1875},{"$f":"Data!L215","v":"SCO"},{"$f":"Data!M215","v":118.8},{"$f":"IF(Data!Q215=\"NOT OPERATIONAL\",\"X\",IF(Data!Q215=\"OPERATIONAL\",\"W\",\"R\"))","v":"W"},{"$f":"Data!N215","v":"A "}]
[null,{"$f":"Data!K216","v":"LOUTH"},{"$f":"Data!D216","v":"GB3LC"},{"$f":"Data!F216","v":430.9375},7.6000000000000227,{"$f":"Data!G216","v":438.53750000000002},{"$f":"Data!L216","v":"MID"},{"$f":"Data!M216","v":71.900000000000006},{"$f":"IF(Data!Q216=\"NOT OPERATIONAL\",\"X\",IF(Data!Q216=\"OPERATIONAL\",\"W\",\"R\"))","v":"W"},{"$f":"Data!N216","v":"A DM DS FU NX "}]
[null,{"$f":"Data!K217","v":"LANCASTER"},{"$f":"Data!D217","v":"GB3LD"},{"$f":"Data!F217","v":145.67500000000001},-0.60000000000002274,{"$f":"Data!G217","v":145.07499999999999},{"$f":"Data!L217","v":"NOR"},{"$f":"Data!M217","v":110.9},{"$f":"IF(Data!Q217=\"NOT OPERATIONAL\",\"X\",IF(Data!Q217=\"OPERATIONAL\",\"W\",\"R\"))","v":"W"},{"$f":"Data!N217","v":"A "}]
[null,{"$f":"Data!K218","v":"MARKFIELD"},{"$f":"Data!D218","v":"GB3LE"},{"$f":"Data!F218","v":433.1},1.5999999999999659,{"$f":"Data!G218","v":434.7},{"$f":"Data!L218","v":"MID"},{"$f":"Data!M218","v":77},{"$f":"IF(Data!Q218=\"NOT OPERATIONAL\",\"X\",IF(Data!Q218=\"OPERATIONAL\",\"W\",\"R\"))","v":"W"},{"$f":"Data!N218","v":"A FU "}]
[null,{"$f":"Data!K219","v":"KENDAL"},{"$f":"Data!D219","v":"GB3LF"},{"$f":"Data!F219","v":433.35},1.5999999999999659,{"$f":"Data!G219","v":434.95},{"$f":"Data!L219","v":"NOR"},{"$f":"Data!M219","v":110.9},{"$f":"IF(Data!Q219=\"NOT OPERATIONAL\",\"X\",IF(Data!Q219=\"OPERATIONAL\",\"W\",\"R\"))","v":"W"},{"$f":"Data!N219","v":"A "}]
[null,{"$f":"Data!K220","v":"LLANGOLLEN"},{"$f":"Data!D220","v":"GB3LG"},{"$f":"Data!F220","v":50.83},0.5,{"$f":"Data!G220","v":51.33},{"$f":"Data!L220","v":"WM"},{"$f":"Data!M220","v":0},{"$f":"IF(Data!Q220=\"NOT OPERATIONAL\",\"X\",IF(Data!Q220=\"OPERATIONAL\",\"W\",\"R\"))","v":"X"},{"$f":"Data!N220","v":"A "}]
[null,{"$f":"Data!K221","v":"SHREWSBURY"},{"$f":"Data!D221","v":"GB3LH"},{"$f":"Data!F221","v":433.375},1.6000000000000227,{"$f":"Data!G221","v":434.97500000000002},{"$f":"Data!L221","v":"MID"},{"$f":"Data!M221","v":103.5},{"$f":"IF(Data!Q221=\"NOT OPERATIONAL\",\"X\",IF(Data!Q221=\"OPERATIONAL\",\"W\",\"R\"))","v":"W"},{"$f":"Data!N221","v":"A FU "}]
[null,{"$f":"Data!K222","v":"LIVERPOOL"},{"$f":"Data!D222","v":"GB3LI"},{"$f":"Data!F222","v":433.25},1.6000000000000227,{"$f":"Data!G222","v":434.85},{"$f":"Data!L222","v":"NOR"},{"$f":"Data!M222","v":82.5},{"$f":"IF(Data!Q222=\"NOT OPERATIONAL\",\"X\",IF(Data!Q222=\"OPERATIONAL\",\"W\",\"R\"))","v":"W"},{"$f":"Data!N222","v":"A "}]
[null,{"$f":"Data!K223","v":"LLANGOLLEN"},{"$f":"Data!D223","v":"GB3LL"},{"$f":"Data!F223","v":433},1.6000000000000227,{"$f":"Data!G223","v":434.6},{"$f":"Data!L223","v":"WM"},{"$f":"Data!M223","v":94.8},{"$f":"IF(Data!Q223=\"NOT OPERATIONAL\",\"X\",IF(Data!Q223=\"OPERATIONAL\",\"W\",\"R\"))","v":"W"},{"$f":"Data!N223","v":"A "}]
[null,{"$f":"Data!K224","v":"LINCOLN"},{"$f":"Data!D224","v":"GB3LM"},{"$f":"Data!F224","v":145.72499999999999},-0.59999999999999432,{"$f":"Data!G224","v":145.125},{"$f":"Data!L224","v":"MID"},{"$f":"Data!M224","v":71.900000000000006},{"$f":"IF(Data!Q224=\"NOT OPERATIONAL\",\"X\",IF(Data!Q224=\"OPERATIONAL\",\"W\",\"R\"))","v":"W"},{"$f":"Data!N224","v":"A FU "}]
[null,{"$f":"Data!K225","v":"LEICESTER"},{"$f":"Data!D225","v":"GB3LN"},{"$f":"Data!F225","v":430.92500000000001},7.5999999999999659,{"$f":"Data!G225","v":438.52499999999998},{"$f":"Data!L225","v":"MID"},{"$f":"Data!M225","v":118.8},{"$f":"IF(Data!Q225=\"NOT OPERATIONAL\",\"X\",IF(Data!Q225=\"OPERATIONAL\",\"W\",\"R\"))","v":"W"},{"$f":"Data!N225","v":"A "}]
[null,{"$f":"Data!K226","v":"LIVERPOOL"},{"$f":"Data!D226","v":"GB3LP"},{"$f":"Data!F226","v":50.75},0.5,{"$f":"Data!G226","v":51.25},{"$f":"Data!L226","v":"NOR"},{"$f":"Data!M226","v":77},{"$f":"IF(Data!Q226=\"NOT OPERATIONAL\",\"X\",IF(Data!Q226=\"OPERATIONAL\",\"W\",\"R\"))","v":"W"},{"$f":"Data!N226","v":"A "}]
[null,{"$f":"Data!K227","v":"NEWHAVEN"},{"$f":"Data!D227","v":"GB3LR"},{"$f":"Data!F227","v":430.86250000000001},7.5999999999999659,{"$f":"Data!G227","v":438.46249999999998},{"$f":"Data!L227","v":"SE"},{"$f":"Data!M227","v":88.5},{"$f":"IF(Data!Q227=\"NOT OPERATIONAL\",\"X\",IF(Data!Q227=\"OPERATIONAL\",\"W\",\"R\"))","v":"W"},{"$f":"Data!N227","v":"A "}]
[null,{"$f":"Data!K228","v":"LINCOLN"},{"$f":"Data!D228","v":"GB3LS"},{"$f":"Data!F228","v":433.05},1.5999999999999659,{"$f":"Data!G228","v":434.65},{"$f":"Data!L228","v":"MID"},{"$f":"Data!M228","v":71.900000000000006},{"$f":"IF(Data!Q228=\"NOT OPERATIONAL\",\"X\",IF(Data!Q228=\"OPERATIONAL\",\"W\",\"R\"))","v":"W"},{"$f":"Data!N228","v":"A "}]
[null,{"$f":"Data!K229","v":"LUTON"},{"$f":"Data!D229","v":"GB3LT"},{"$f":"Data!F229","v":433.25},1.6000000000000227,{"$f":"Data!G229","v":434.85},{"$f":"Data!L229","v":"SE"},{"$f":"Data!M229","v":77},{"$f":"IF(Data!Q229=\"NOT OPERATIONAL\",\"X\",IF(Data!Q229=\"OPERATIONAL\",\"W\",\"R\"))","v":"W"},{"$f":"Data!N229","v":"A FU "}]
[null,{"$f":"Data!K230","v":"LERWICK"},{"$f":"Data!D230","v":"GB3LU"},{"$f":"Data!F230","v":145.67500000000001},-0.60000000000002274,{"$f":"Data!G230","v":145.07499999999999},{"$f":"Data!L230","v":"SCO"},{"$f":"Data!M230","v":77},{"$f":"IF(Data!Q230=\"NOT OPERATIONAL\",\"X\",IF(Data!Q230=\"OPERATIONAL\",\"W\",\"R\"))","v":"W"},{"$f":"Data!N230","v":"A "}]
[null,{"$f":"Data!K231","v":"NORTH LONDON"},{"$f":"Data!D231","v":"GB3LV"},{"$f":"Data!F231","v":433.05},1.5999999999999659,{"$f":"Data!G231","v":434.65},{"$f":"Data!L231","v":"SE"},{"$f":"Data!M231","v":82.5},{"$f":"IF(Data!Q231=\"NOT OPERATIONAL\",\"X\",IF(Data!Q231=\"OPERATIONAL\",\"W\",\"R\"))","v":"W"},{"$f":"Data!N231","v":"A "}]
[null,{"$f":"Data!K232","v":"LIMAVADY"},{"$f":"Data!D232","v":"GB3LY"},{"$f":"Data!F232","v":145.6},-0.59999999999999432,{"$f":"Data!G232","v":145},{"$f":"Data!L232","v":"NI"},{"$f":"Data!M232","v":110.9},{"$f":"IF(Data!Q232=\"NOT OPERATIONAL\",\"X\",IF(Data!Q232=\"OPERATIONAL\",\"W\",\"R\"))","v":"W"},{"$f":"Data!N232","v":"A "}]
[null,{"$f":"Data!K233","v":"WINKLEIGH"},{"$f":"Data!D233","v":"GB3LZ"},{"$f":"Data!F233","v":145.66249999999999},-0.59999999999999432,{"$f":"Data!G233","v":145.0625},{"$f":"Data!L233","v":"SW"},{"$f":"Data!M233","v":77},{"$f":"IF(Data!Q233=\"NOT OPERATIONAL\",\"X\",IF(Data!Q233=\"OPERATIONAL\",\"W\",\"R\"))","v":"W"},{"$f":"Data!N233","v":"A DM FU "}]
[null,{"$f":"Data!K234","v":"ATHERTON"},{"$f":"Data!D234","v":"GB3MA"},{"$f":"Data!F234","v":50.72},0.5,{"$f":"Data!G234","v":51.22},{"$f":"Data!L234","v":"NOR"},{"$f":"Data!M234","v":82.5},{"$f":"IF(Data!Q234=\"NOT OPERATIONAL\",\"X\",IF(Data!Q234=\"OPERATIONAL\",\"W\",\"R\"))","v":"X"},{"$f":"Data!N234","v":"A "}]
[null,{"$f":"Data!K235","v":"MERTHYR"},{"$f":"Data!D235","v":"GB3MB"},{"$f":"Data!F235","v":433.375},1.6000000000000227,{"$f":"Data!G235","v":434.97500000000002},{"$f":"Data!L235","v":"WM"},{"$f":"Data!M235","v":94.8},{"$f":"IF(Data!Q235=\"NOT OPERATIONAL\",\"X\",IF(Data!Q235=\"OPERATIONAL\",\"W\",\"R\"))","v":"W"},{"$f":"Data!N235","v":"A FU "}]
[null,{"$f":"Data!K236","v":"LEASOWE"},{"$f":"Data!D236","v":"GB3MC"},{"$f":"Data!F236","v":439.33749999999998},-9,{"$f":"Data!G236","v":430.33749999999998},{"$f":"Data!L236","v":"NOR"},{"$f":"Data!M236","v":110.9},{"$f":"IF(Data!Q236=\"NOT OPERATIONAL\",\"X\",IF(Data!Q236=\"OPERATIONAL\",\"W\",\"R\"))","v":"W"},{"$f":"Data!N236","v":"A FU "}]
[null,{"$f":"Data!K237","v":"LLANFAIR CAEREINION"},{"$f":"Data!D237","v":"GB3MD"},{"$f":"Data!F237","v":430.96249999999998},7.6000000000000227,{"$f":"Data!G237","v":438.5625},{"$f":"Data!L237","v":"WM"},{"$f":"Data!M237","v":103.5},{"$f":"IF(Data!Q237=\"NOT OPERATIONAL\",\"X\",IF(Data!Q237=\"OPERATIONAL\",\"W\",\"R\"))","v":"X"},{"$f":"Data!N237","v":"A FU "}]
[null,{"$f":"Data!K238","v":"RUGBY"},{"$f":"Data!D238","v":"GB3ME"},{"$f":"Data!F238","v":433.15},1.6000000000000227,{"$f":"Data!G238","v":434.75},{"$f":"Data!L238","v":"MID"},{"$f":"Data!M238","v":67},{"$f":"IF(Data!Q238=\"NOT OPERATIONAL\",\"X\",IF(Data!Q238=\"OPERATIONAL\",\"W\",\"R\"))","v":"W"},{"$f":"Data!N238","v":"A "}]
[null,{"$f":"Data!K239","v":"PONTYPRIDD"},{"$f":"Data!D239","v":"GB3MG"},{"$f":"Data!F239","v":430.9},7.6000000000000227,{"$f":"Data!G239","v":438.5},{"$f":"Data!L239","v":"WM"},{"$f":"Data!M239","v":0},{"$f":"IF(Data!Q239=\"NOT OPERATIONAL\",\"X\",IF(Data!Q239=\"OPERATIONAL\",\"W\",\"R\"))","v":"W"},{"$f":"Data!N239","v":"A FU "}]
[null,{"$f":"Data!K240","v":"EAST GRINSTEAD"},{"$f":"Data!D240","v":"GB3MH"},{"$f":"Data!F240","v":145.625},-0.59999999999999432,{"$f":"Data!G240","v":145.02500000000001},{"$f":"Data!L240","v":"SE"},{"$f":"Data!M240","v":88.5},{"$f":"IF(Data!Q240=\"NOT OPERATIONAL\",\"X\",IF(Data!Q240=\"OPERATIONAL\",\"W\",\"R\"))","v":"W"},{"$f":"Data!N240","v":"A "}]
[null,{"$f":"Data!K241","v":"MANCHESTER"},{"$f":"Data!D241","v":"GB3MI"},{"$f":"Data!F241","v":145.71250000000001},-0.59999999999999432,{"$f":"Data!G241","v":145.11250000000001},{"$f":"Data!L241","v":"NOR"},{"$f":"Data!M241","v":82.5},{"$f":"IF(Data!Q241=\"NOT OPERATIONAL\",\"X\",IF(Data!Q241=\"OPERATIONAL\",\"W\",\"R\"))","v":"W"},{"$f":"Data!N241","v":"A "}]
[null,{"$f":"Data!K242","v":"MILTON KEYNES"},{"$f":"Data!D242","v":"GB3MK"},{"$f":"Data!F242","v":433},1.6000000000000227,{"$f":"Data!G242","v":434.6},{"$f":"Data!L242","v":"SE"},{"$f":"Data!M242","v":77},{"$f":"IF(Data!Q242=\"NOT OPERATIONAL\",\"X\",IF(Data!Q242=\"OPERATIONAL\",\"W\",\"R\"))","v":"W"},{"$f":"Data!N242","v":"A FU "}]
[null,{"$f":"Data!K243","v":"STAINES UPON THAMES"},{"$f":"Data!D243","v":"GB3ML"},{"$f":"Data!F243","v":430.91250000000002},7.5999999999999659,{"$f":"Data!G243","v":438.51249999999999},{"$f":"Data!L243","v":"SE"},{"$f":"Data!M243","v":103.5},{"$f":"IF(Data!Q243=\"NOT OPERATIONAL\",\"X\",IF(Data!Q243=\"OPERATIONAL\",\"W\",\"R\"))","v":"W"},{"$f":"Data!N243","v":"A DM DS FU "}]
[null,{"$f":"Data!K244","v":"DISLEY"},{"$f":"Data!D244","v":"GB3MN"},{"$f":"Data!F244","v":145.65},-0.59999999999999432,{"$f":"Data!G244","v":145.05000000000001},{"$f":"Data!L244","v":"NOR"},{"$f":"Data!M244","v":82.5},{"$f":"IF(Data!Q244=\"NOT OPERATIONAL\",\"X\",IF(Data!Q244=\"OPERATIONAL\",\"W\",\"R\"))","v":"W"},{"$f":"Data!N244","v":"A FU "}]
[null,{"$f":"Data!K245","v":"MORECAMBE"},{"$f":"Data!D245","v":"GB3MO"},{"$f":"Data!F245","v":438.38749999999999},-7.5999999999999659,{"$f":"Data!G245","v":430.78750000000002},{"$f":"Data!L245","v":"NOR"},{"$f":"Data!M245","v":110.9},{"$f":"IF(Data!Q245=\"NOT OPERATIONAL\",\"X\",IF(Data!Q245=\"OPERATIONAL\",\"W\",\"R\"))","v":"W"},{"$f":"Data!N245","v":"A "}]
[null,{"$f":"Data!K246","v":"PRESTATYN"},{"$f":"Data!D246","v":"GB3MP"},{"$f":"Data!F246","v":145.75},-0.59999999999999432,{"$f":"Data!G246","v":145.15},{"$f":"Data!L246","v":"WM"},{"$f":"Data!M246","v":110.9},{"$f":"IF(Data!Q246=\"NOT OPERATIONAL\",\"X\",IF(Data!Q246=\"OPERATIONAL\",\"W\",\"R\"))","v":"W"},{"$f":"Data!N246","v":"A "}]
[null,{"$f":"Data!K247","v":"STOCKPORT"},{"$f":"Data!D247","v":"GB3MR"},{"$f":"Data!F247","v":433.35},1.5999999999999659,{"$f":"Data!G247","v":434.95},{"$f":"Data!L247","v":"NOR"},{"$f":"Data!M247","v":82.5},{"$f":"IF(Data!Q247=\"NOT OPERATIONAL\",\"X\",IF(Data!Q247=\"OPERATIONAL\",\"W\",\"R\"))","v":"W"},{"$f":"Data!N247","v":"A "}]
[null,{"$f":"Data!K248","v":"MALVERN "},{"$f":"Data!D248","v":"GB3MS "},{"$f":"Data!F248","v":433},1.6000000000000227,{"$f":"Data!G248","v":434.6},{"$f":"Data!L248","v":"MID"},{"$f":"Data!M248","v":67},{"$f":"IF(Data!Q248=\"NOT OPERATIONAL\",\"X\",IF(Data!Q248=\"OPERATIONAL\",\"W\",\"R\"))","v":"X"},{"$f":"Data!N248","v":"A FU "}]
[null,{"$f":"Data!K249","v":"MAGHERAFELT"},{"$f":"Data!D249","v":"GB3MT"},{"$f":"Data!F249","v":145.65},-0.59999999999999432,{"$f":"Data!G249","v":145.05000000000001},{"$f":"Data!L249","v":"NI"},{"$f":"Data!M249","v":110.9},{"$f":"IF(Data!Q249=\"NOT OPERATIONAL\",\"X\",IF(Data!Q249=\"OPERATIONAL\",\"W\",\"R\"))","v":"W"},{"$f":"Data!N249","v":"A "}]
[null,{"$f":"Data!K250","v":"LEAMINGTON SPA"},{"$f":"Data!D250","v":"GB3MW"},{"$f":"Data!F250","v":433.25},1.6000000000000227,{"$f":"Data!G250","v":434.85},{"$f":"Data!L250","v":"MID"},{"$f":"Data!M250","v":67},{"$f":"IF(Data!Q250=\"NOT OPERATIONAL\",\"X\",IF(Data!Q250=\"OPERATIONAL\",\"W\",\"R\"))","v":"W"},{"$f":"Data!N250","v":"A "}]
[null,{"$f":"Data!K251","v":"MARYPORT"},{"$f":"Data!D251","v":"GB3MX"},{"$f":"Data!F251","v":145.63749999999999},-0.59999999999999432,{"$f":"Data!G251","v":145.03749999999999},{"$f":"Data!L251","v":"NOR"},{"$f":"Data!M251","v":77},{"$f":"IF(Data!Q251=\"NOT OPERATIONAL\",\"X\",IF(Data!Q251=\"OPERATIONAL\",\"W\",\"R\"))","v":"W"},{"$f":"Data!N251","v":"A FU "}]
[null,{"$f":"Data!K252","v":"ATHERTON"},{"$f":"Data!D252","v":"GB3MY"},{"$f":"Data!F252","v":433.27499999999998},1.6000000000000227,{"$f":"Data!G252","v":434.875},{"$f":"Data!L252","v":"NOR"},{"$f":"Data!M252","v":82.5},{"$f":"IF(Data!Q252=\"NOT OPERATIONAL\",\"X\",IF(Data!Q252=\"OPERATIONAL\",\"W\",\"R\"))","v":"W"},{"$f":"Data!N252","v":"A FU "}]
[null,{"$f":"Data!K253","v":"BARNSLEY"},{"$f":"Data!D253","v":"GB3NA"},{"$f":"Data!F253","v":145.61250000000001},-0.60000000000002274,{"$f":"Data!G253","v":145.01249999999999},{"$f":"Data!L253","v":"NOR"},{"$f":"Data!M253","v":71.900000000000006},{"$f":"IF(Data!Q253=\"NOT OPERATIONAL\",\"X\",IF(Data!Q253=\"OPERATIONAL\",\"W\",\"R\"))","v":"W"},{"$f":"Data!N253","v":"A DS FU "}]
[null,{"$f":"Data!K254","v":"NORWICH"},{"$f":"Data!D254","v":"GB3NB"},{"$f":"Data!F254","v":145.625},-0.59999999999999432,{"$f":"Data!G254","v":145.02500000000001},{"$f":"Data!L254","v":"EA"},{"$f":"Data!M254","v":94.8},{"$f":"IF(Data!Q254=\"NOT OPERATIONAL\",\"X\",IF(Data!Q254=\"OPERATIONAL\",\"W\",\"R\"))","v":"W"},{"$f":"Data!N254","v":"A "}]
[null,{"$f":"Data!K255","v":"ROCHE"},{"$f":"Data!D255","v":"GB3NC"},{"$f":"Data!F255","v":145.72499999999999},-0.59999999999999432,{"$f":"Data!G255","v":145.125},{"$f":"Data!L255","v":"SW"},{"$f":"Data!M255","v":77},{"$f":"IF(Data!Q255=\"NOT OPERATIONAL\",\"X\",IF(Data!Q255=\"OPERATIONAL\",\"W\",\"R\"))","v":"W"},{"$f":"Data!N255","v":"A FU "}]
[null,{"$f":"Data!K256","v":"NEAR HOLSWORTHY"},{"$f":"Data!D256","v":"GB3ND"},{"$f":"Data!F256","v":439.73750000000001},-9,{"$f":"Data!G256","v":430.73750000000001},{"$f":"Data!L256","v":"SW"},{"$f":"Data!M256","v":0},{"$f":"IF(Data!Q256=\"NOT OPERATIONAL\",\"X\",IF(Data!Q256=\"OPERATIONAL\",\"W\",\"R\"))","v":"W"},{"$f":"Data!N256","v":"DM "}]
[null,{"$f":"Data!K257","v":"NEWBURY"},{"$f":"Data!D257","v":"GB3NE"},{"$f":"Data!F257","v":145.76249999999999},-0.59999999999999432,{"$f":"Data!G257","v":145.16249999999999},{"$f":"Data!L257","v":"SW"},{"$f":"Data!M257","v":118.8},{"$f":"IF(Data!Q257=\"NOT OPERATIONAL\",\"X\",IF(Data!Q257=\"OPERATIONAL\",\"W\",\"R\"))","v":"W"},{"$f":"Data!N257","v":"A "}]
[null,{"$f":"Data!K258","v":"NOTTINGHAM"},{"$f":"Data!D258","v":"GB3NF"},{"$f":"Data!F258","v":145.625},-0.59999999999999432,{"$f":"Data!G258","v":145.02500000000001},{"$f":"Data!L258","v":"MID"},{"$f":"Data!M258","v":77},{"$f":"IF(Data!Q258=\"NOT OPERATIONAL\",\"X\",IF(Data!Q258=\"OPERATIONAL\",\"W\",\"R\"))","v":"W"},{"$f":"Data!N258","v":"A DM FU "}]
[null,{"$f":"Data!K259","v":"FRASERBURGH"},{"$f":"Data!D259","v":"GB3NG"},{"$f":"Data!F259","v":145.625},-0.59999999999999432,{"$f":"Data!G259","v":145.02500000000001},{"$f":"Data!L259","v":"SCO"},{"$f":"Data!M259","v":67},{"$f":"IF(Data!Q259=\"NOT OPERATIONAL\",\"X\",IF(Data!Q259=\"OPERATIONAL\",\"W\",\"R\"))","v":"W"},{"$f":"Data!N259","v":"A "}]
[null,{"$f":"Data!K260","v":"NORTHAMPTON"},{"$f":"Data!D260","v":"GB3NH"},{"$f":"Data!F260","v":430.95},7.6000000000000227,{"$f":"Data!G260","v":438.55},{"$f":"Data!L260","v":"MID"},{"$f":"Data!M260","v":77},{"$f":"IF(Data!Q260=\"NOT OPERATIONAL\",\"X\",IF(Data!Q260=\"OPERATIONAL\",\"W\",\"R\"))","v":"W"},{"$f":"Data!N260","v":"A "}]
[null,{"$f":"Data!K261","v":"BELFAST  N.I."},{"$f":"Data!D261","v":"GB3NI"},{"$f":"Data!F261","v":145.72499999999999},-0.59999999999999432,{"$f":"Data!G261","v":145.125},{"$f":"Data!L261","v":"NI"},{"$f":"Data!M261","v":110.9},{"$f":"IF(Data!Q261=\"NOT OPERATIONAL\",\"X\",IF(Data!Q261=\"OPERATIONAL\",\"W\",\"R\"))","v":"W"},{"$f":"Data!N261","v":"A "}]
[null,{"$f":"Data!K262","v":"ERITH"},{"$f":"Data!D262","v":"GB3NK"},{"$f":"Data!F262","v":433.1},1.5999999999999659,{"$f":"Data!G262","v":434.7},{"$f":"Data!L262","v":"SE"},{"$f":"Data!M262","v":103.5},{"$f":"IF(Data!Q262=\"NOT OPERATIONAL\",\"X\",IF(Data!Q262=\"OPERATIONAL\",\"W\",\"R\"))","v":"W"},{"$f":"Data!N262","v":"A "}]
[null,{"$f":"Data!K263","v":"NORTH LONDON"},{"$f":"Data!D263","v":"GB3NL"},{"$f":"Data!F263","v":145.77500000000001},-0.59999999999999432,{"$f":"Data!G263","v":145.17500000000001},{"$f":"Data!L263","v":"SE"},{"$f":"Data!M263","v":82.5},{"$f":"IF(Data!Q263=\"NOT OPERATIONAL\",\"X\",IF(Data!Q263=\"OPERATIONAL\",\"W\",\"R\"))","v":"W"},{"$f":"Data!N263","v":"A "}]
[null,{"$f":"Data!K264","v":"NOTTINGHAM"},{"$f":"Data!D264","v":"GB3NM"},{"$f":"Data!F264","v":433.17500000000001},1.5999999999999659,{"$f":"Data!G264","v":434.77499999999998},{"$f":"Data!L264","v":"MID"},{"$f":"Data!M264","v":71.900000000000006},{"$f":"IF(Data!Q264=\"NOT OPERATIONAL\",\"X\",IF(Data!Q264=\"OPERATIONAL\",\"W\",\"R\"))","v":"W"},{"$f":"Data!N264","v":"A "}]
[null,{"$f":"Data!K265","v":"WELLS NORFOLK"},{"$f":"Data!D265","v":"GB3NN"},{"$f":"Data!F265","v":433.05},{"$f":"F265-D265","v":1.5999999999999659},{"$f":"Data!G265","v":434.65},{"$f":"Data!L265","v":"EA"},{"$f":"Data!M265","v":94.8},{"$f":"IF(Data!Q265=\"NOT OPERATIONAL\",\"X\",IF(Data!Q265=\"OPERATIONAL\",\"W\",\"R\"))","v":"W"},{"$f":"Data!N265","v":"A "}]
[null,{"$f":"Data!K266","v":"TOWCESTER"},{"$f":"Data!D266","v":"GB3NP"},{"$f":"Data!F266","v":430.88749999999999},7.6000000000000227,{"$f":"Data!G266","v":438.48750000000001},{"$f":"Data!L266","v":"MID"},{"$f":"Data!M266","v":77},{"$f":"IF(Data!Q266=\"NOT OPERATIONAL\",\"X\",IF(Data!Q266=\"OPERATIONAL\",\"W\",\"R\"))","v":"W"},{"$f":"Data!N266","v":"A FU "}]
[null,{"$f":"Data!K267","v":"NORWICH"},{"$f":"Data!D267","v":"GB3NR"},{"$f":"Data!F267","v":433},1.6000000000000227,{"$f":"Data!G267","v":434.6},{"$f":"Data!L267","v":"EA"},{"$f":"Data!M267","v":94.8},{"$f":"IF(Data!Q267=\"NOT OPERATIONAL\",\"X\",IF(Data!Q267=\"OPERATIONAL\",\"W\",\"R\"))","v":"W"},{"$f":"Data!N267","v":"A "}]
[null,{"$f":"Data!K268","v":"BANSTEAD"},{"$f":"Data!D268","v":"GB3NS"},{"$f":"Data!F268","v":439.67500000000001},-9,{"$f":"Data!G268","v":430.67500000000001},{"$f":"Data!L268","v":"SE"},{"$f":"Data!M268","v":82.5},{"$f":"IF(Data!Q268=\"NOT OPERATIONAL\",\"X\",IF(Data!Q268=\"OPERATIONAL\",\"W\",\"R\"))","v":"W"},{"$f":"Data!N268","v":"A "}]
[null,{"$f":"Data!K269","v":"NEWCASTLE UPON TYNE"},{"$f":"Data!D269","v":"GB3NT"},{"$f":"Data!F269","v":433},1.6000000000000227,{"$f":"Data!G269","v":434.6},{"$f":"Data!L269","v":"NOR"},{"$f":"Data!M269","v":118.8},{"$f":"IF(Data!Q269=\"NOT OPERATIONAL\",\"X\",IF(Data!Q269=\"OPERATIONAL\",\"W\",\"R\"))","v":"W"},{"$f":"Data!N269","v":"A FU "}]
[null,{"$f":"Data!K270","v":"NOTTINGHAM"},{"$f":"Data!D270","v":"GB3NW"},{"$f":"Data!F270","v":439.48750000000001},-9,{"$f":"Data!G270","v":430.48750000000001},{"$f":"Data!L270","v":"MID"},{"$f":"Data!M270","v":71.900000000000006},{"$f":"IF(Data!Q270=\"NOT OPERATIONAL\",\"X\",IF(Data!Q270=\"OPERATIONAL\",\"W\",\"R\"))","v":"X"},{"$f":"Data!N270","v":"DM "}]
[null,{"$f":"Data!K271","v":"NEAR HOLSWORTHY"},{"$f":"Data!D271","v":"GB3NX"},{"$f":"Data!F271","v":145.73750000000001},-0.60000000000002274,{"$f":"Data!G271","v":145.13749999999999},{"$f":"Data!L271","v":"SW"},{"$f":"Data!M271","v":77},{"$f":"IF(Data!Q271=\"NOT OPERATIONAL\",\"X\",IF(Data!Q271=\"OPERATIONAL\",\"W\",\"R\"))","v":"W"},{"$f":"Data!N271","v":"A DM DS FU "}]
[null,{"$f":"Data!K272","v":"HULL"},{"$f":"Data!D272","v":"GB3NY"},{"$f":"Data!F272","v":430.83749999999998},7.6000000000000227,{"$f":"Data!G272","v":438.4375},{"$f":"Data!L272","v":"NOR"},{"$f":"Data!M272","v":67},{"$f":"IF(Data!Q272=\"NOT OPERATIONAL\",\"X\",IF(Data!Q272=\"OPERATIONAL\",\"W\",\"R\"))","v":"W"},{"$f":"Data!N272","v":"A FU "}]
[null,{"$f":"Data!K273","v":"SOUTHPORT"},{"$f":"Data!D273","v":"GB3OA"},{"$f":"Data!F273","v":145.61250000000001},-0.60000000000002274,{"$f":"Data!G273","v":145.01249999999999},{"$f":"Data!L273","v":"NOR"},{"$f":"Data!M273","v":82.5},{"$f":"IF(Data!Q273=\"NOT OPERATIONAL\",\"X\",IF(Data!Q273=\"OPERATIONAL\",\"W\",\"R\"))","v":"W"},{"$f":"Data!N273","v":"A FU "}]
[null,{"$f":"Data!K274","v":"KIRKWALL"},{"$f":"Data!D274","v":"GB3OC"},{"$f":"Data!F274","v":145.65},-0.59999999999999432,{"$f":"Data!G274","v":145.05000000000001},{"$f":"Data!L274","v":"SCO"},{"$f":"Data!M274","v":77},{"$f":"IF(Data!Q274=\"NOT OPERATIONAL\",\"X\",IF(Data!Q274=\"OPERATIONAL\",\"W\",\"R\"))","v":"W"},{"$f":"Data!N274","v":"A "}]
[null,{"$f":"Data!K275","v":"LLANDUDNO"},{"$f":"Data!D275","v":"GB3OD"},{"$f":"Data!F275","v":430.28750000000002},9,{"$f":"Data!G275","v":439.28750000000002},{"$f":"Data!L275","v":"WM"},{"$f":"Data!M275","v":0},{"$f":"IF(Data!Q275=\"NOT OPERATIONAL\",\"X\",IF(Data!Q275=\"OPERATIONAL\",\"W\",\"R\"))","v":"W"},{"$f":"Data!N275","v":"DM "}]
[null,{"$f":"Data!K276","v":"LLANDUDNO"},{"$f":"Data!D276","v":"GB3OG"},{"$f":"Data!F276","v":145.78749999999999},-0.59999999999999432,{"$f":"Data!G276","v":145.1875},{"$f":"Data!L276","v":"WM"},{"$f":"Data!M276","v":110.9},{"$f":"IF(Data!Q276=\"NOT OPERATIONAL\",\"X\",IF(Data!Q276=\"OPERATIONAL\",\"W\",\"R\"))","v":"X"},{"$f":"Data!N276","v":"A FU "}]
[null,{"$f":"Data!K277","v":"LINLITHGOW"},{"$f":"Data!D277","v":"GB3OH"},{"$f":"Data!F277","v":430.95},7.6000000000000227,{"$f":"Data!G277","v":438.55},{"$f":"Data!L277","v":"SCO"},{"$f":"Data!M277","v":94.8},{"$f":"IF(Data!Q277=\"NOT OPERATIONAL\",\"X\",IF(Data!Q277=\"OPERATIONAL\",\"W\",\"R\"))","v":"W"},{"$f":"Data!N277","v":"A DM DS FU "}]
[null,{"$f":"Data!K278","v":"OMAGH"},{"$f":"Data!D278","v":"GB3OM"},{"$f":"Data!F278","v":430.95},7.6000000000000227,{"$f":"Data!G278","v":438.55},{"$f":"Data!L278","v":"NI"},{"$f":"Data!M278","v":110.9},{"$f":"IF(Data!Q278=\"NOT OPERATIONAL\",\"X\",IF(Data!Q278=\"OPERATIONAL\",\"W\",\"R\"))","v":"W"},{"$f":"Data!N278","v":"A DM "}]
[null,{"$f":"Data!K279","v":"PORTSMOUTH"},{"$f":"Data!D279","v":"GB3OP"},{"$f":"Data!F279","v":439.375},-9,{"$f":"Data!G279","v":430.375},{"$f":"Data!L279","v":"SW"},{"$f":"Data!M279","v":71.900000000000006},{"$f":"IF(Data!Q279=\"NOT OPERATIONAL\",\"X\",IF(Data!Q279=\"OPERATIONAL\",\"W\",\"R\"))","v":"W"},{"$f":"Data!N279","v":"A "}]
[null,{"$f":"Data!K280","v":"LLANDUDNO"},{"$f":"Data!D280","v":"GB3OR"},{"$f":"Data!F280","v":430.83749999999998},7.6000000000000227,{"$f":"Data!G280","v":438.4375},{"$f":"Data!L280","v":"WM"},{"$f":"Data!M280","v":103.5},{"$f":"IF(Data!Q280=\"NOT OPERATIONAL\",\"X\",IF(Data!Q280=\"OPERATIONAL\",\"W\",\"R\"))","v":"W"},{"$f":"Data!N280","v":"A FU "}]
[null,{"$f":"Data!K281","v":"GRAVELEY"},{"$f":"Data!D281","v":"GB3OV"},{"$f":"Data!F281","v":439.375},-9,{"$f":"Data!G281","v":430.375},{"$f":"Data!L281","v":"EA"},{"$f":"Data!M281","v":94.8},{"$f":"IF(Data!Q281=\"NOT OPERATIONAL\",\"X\",IF(Data!Q281=\"OPERATIONAL\",\"W\",\"R\"))","v":"W"},{"$f":"Data!N281","v":"A "}]
[null,{"$f":"Data!K282","v":"BUCKHURST HILL"},{"$f":"Data!D282","v":"GB3OY"},{"$f":"Data!F282","v":430.95},7.6000000000000227,{"$f":"Data!G282","v":438.55},{"$f":"Data!L282","v":"SE"},{"$f":"Data!M282","v":82.5},{"$f":"IF(Data!Q282=\"NOT OPERATIONAL\",\"X\",IF(Data!Q282=\"OPERATIONAL\",\"W\",\"R\"))","v":"W"},{"$f":"Data!N282","v":"A "}]
[null,{"$f":"Data!K283","v":"PAISLEY"},{"$f":"Data!D283","v":"GB3PA"},{"$f":"Data!F283","v":145.625},-0.59999999999999432,{"$f":"Data!G283","v":145.02500000000001},{"$f":"Data!L283","v":"SCO"},{"$f":"Data!M283","v":103.5},{"$f":"IF(Data!Q283=\"NOT OPERATIONAL\",\"X\",IF(Data!Q283=\"OPERATIONAL\",\"W\",\"R\"))","v":"W"},{"$f":"Data!N283","v":"A "}]
[null,{"$f":"Data!K284","v":"WIMBORNE"},{"$f":"Data!D284","v":"GB3PB"},{"$f":"Data!F284","v":145.625},-0.59999999999999432,{"$f":"Data!G284","v":145.02500000000001},{"$f":"Data!L284","v":"SW"},{"$f":"Data!M284","v":71.900000000000006},{"$f":"IF(Data!Q284=\"NOT OPERATIONAL\",\"X\",IF(Data!Q284=\"OPERATIONAL\",\"W\",\"R\"))","v":"W"},{"$f":"Data!N284","v":"A "}]
[null,{"$f":"Data!K285","v":"FARNBOROUGH"},{"$f":"Data!D285","v":"GB3PC"},{"$f":"Data!F285","v":430.28750000000002},9,{"$f":"Data!G285","v":439.28750000000002},{"$f":"Data!L285","v":"SW"},{"$f":"Data!M285","v":118.8},{"$f":"IF(Data!Q285=\"NOT OPERATIONAL\",\"X\",IF(Data!Q285=\"OPERATIONAL\",\"W\",\"R\"))","v":"W"},{"$f":"Data!N285","v":"A DM "}]
[null,{"$f":"Data!K286","v":"WEYMOUTH"},{"$f":"Data!D286","v":"GB3PD"},{"$f":"Data!F286","v":430.85},7.5999999999999659,{"$f":"Data!G286","v":438.45},{"$f":"Data!L286","v":"SW"},{"$f":"Data!M286","v":0},{"$f":"IF(Data!Q286=\"NOT OPERATIONAL\",\"X\",IF(Data!Q286=\"OPERATIONAL\",\"W\",\"R\"))","v":"W"},{"$f":"Data!N286","v":"A FU "}]
[null,{"$f":"Data!K287","v":"PETERBOROUGH"},{"$f":"Data!D287","v":"GB3PE"},{"$f":"Data!F287","v":145.67500000000001},-0.60000000000002274,{"$f":"Data!G287","v":145.07499999999999},{"$f":"Data!L287","v":"EA"},{"$f":"Data!M287","v":94.8},{"$f":"IF(Data!Q287=\"NOT OPERATIONAL\",\"X\",IF(Data!Q287=\"OPERATIONAL\",\"W\",\"R\"))","v":"W"},{"$f":"Data!N287","v":"A "}]
[null,{"$f":"Data!K288","v":"ACCRINGTON"},{"$f":"Data!D288","v":"GB3PF"},{"$f":"Data!F288","v":430.92500000000001},7.5999999999999659,{"$f":"Data!G288","v":438.52499999999998},{"$f":"Data!L288","v":"NOR"},{"$f":"Data!M288","v":94.8},{"$f":"IF(Data!Q288=\"NOT OPERATIONAL\",\"X\",IF(Data!Q288=\"OPERATIONAL\",\"W\",\"R\"))","v":"W"},{"$f":"Data!N288","v":"A "}]
[null,{"$f":"Data!K289","v":"PWLLHELI"},{"$f":"Data!D289","v":"GB3PH"},{"$f":"Data!F289","v":145.66249999999999},-0.59999999999999432,{"$f":"Data!G289","v":145.0625},{"$f":"Data!L289","v":"WM"},{"$f":"Data!M289","v":118.8},{"$f":"IF(Data!Q289=\"NOT OPERATIONAL\",\"X\",IF(Data!Q289=\"OPERATIONAL\",\"W\",\"R\"))","v":"W"},{"$f":"Data!N289","v":"A "}]
[null,{"$f":"Data!K290","v":"ROYSTON"},{"$f":"Data!D290","v":"GB3PI"},{"$f":"Data!F290","v":145.75},-0.59999999999999432,{"$f":"Data!G290","v":145.15},{"$f":"Data!L290","v":"SE"},{"$f":"Data!M290","v":77},{"$f":"IF(Data!Q290=\"NOT OPERATIONAL\",\"X\",IF(Data!Q290=\"OPERATIONAL\",\"W\",\"R\"))","v":"W"},{"$f":"Data!N290","v":"A "}]
[null,{"$f":"Data!K291","v":"BALLYCASTLE"},{"$f":"Data!D291","v":"GB3PK"},{"$f":"Data!F291","v":145.66249999999999},-0.59999999999999432,{"$f":"Data!G291","v":145.0625},{"$f":"Data!L291","v":"NI"},{"$f":"Data!M291","v":110.9},{"$f":"IF(Data!Q291=\"NOT OPERATIONAL\",\"X\",IF(Data!Q291=\"OPERATIONAL\",\"W\",\"R\"))","v":"W"},{"$f":"Data!N291","v":"A "}]
[null,{"$f":"Data!K292","v":"PLYMPTON"},{"$f":"Data!D292","v":"GB3PL"},{"$f":"Data!F292","v":145.76249999999999},-0.59999999999999432,{"$f":"Data!G292","v":145.16249999999999},{"$f":"Data!L292","v":"SW"},{"$f":"Data!M292","v":77},{"$f":"IF(Data!Q292=\"NOT OPERATIONAL\",\"X\",IF(Data!Q292=\"OPERATIONAL\",\"W\",\"R\"))","v":"W"},{"$f":"Data!N292","v":"A "}]
[null,{"$f":"Data!K293","v":"SHEFFIELD"},{"$f":"Data!D293","v":"GB3PM"},{"$f":"Data!F293","v":430.9},7.6000000000000227,{"$f":"Data!G293","v":438.5},{"$f":"Data!L293","v":"NOR"},{"$f":"Data!M293","v":71.900000000000006},{"$f":"IF(Data!Q293=\"NOT OPERATIONAL\",\"X\",IF(Data!Q293=\"OPERATIONAL\",\"W\",\"R\"))","v":"W"},{"$f":"Data!N293","v":"A "}]
[null,{"$f":"Data!K294","v":"BLACKPOOL"},{"$f":"Data!D294","v":"GB3PN"},{"$f":"Data!F294","v":430.95},7.6000000000000227,{"$f":"Data!G294","v":438.55},{"$f":"Data!L294","v":"NOR"},{"$f":"Data!M294","v":82.5},{"$f":"IF(Data!Q294=\"NOT OPERATIONAL\",\"X\",IF(Data!Q294=\"OPERATIONAL\",\"W\",\"R\"))","v":"W"},{"$f":"Data!N294","v":"A "}]
[null,{"$f":"Data!K295","v":"IPSWICH"},{"$f":"Data!D295","v":"GB3PO"},{"$f":"Data!F295","v":145.65},-0.59999999999999432,{"$f":"Data!G295","v":145.05000000000001},{"$f":"Data!L295","v":"EA"},{"$f":"Data!M295","v":110.9},{"$f":"IF(Data!Q295=\"NOT OPERATIONAL\",\"X\",IF(Data!Q295=\"OPERATIONAL\",\"W\",\"R\"))","v":"W"},{"$f":"Data!N295","v":"A "}]
[null,{"$f":"Data!K296","v":"PRESTON"},{"$f":"Data!D296","v":"GB3PP"},{"$f":"Data!F296","v":433.375},1.6000000000000227,{"$f":"Data!G296","v":434.97500000000002},{"$f":"Data!L296","v":"NOR"},{"$f":"Data!M296","v":82.5},{"$f":"IF(Data!Q296=\"NOT OPERATIONAL\",\"X\",IF(Data!Q296=\"OPERATIONAL\",\"W\",\"R\"))","v":"W"},{"$f":"Data!N296","v":"A DM FU "}]
[null,{"$f":"Data!K297","v":"PERTH"},{"$f":"Data!D297","v":"GB3PR"},{"$f":"Data!F297","v":145.67500000000001},-0.60000000000002274,{"$f":"Data!G297","v":145.07499999999999},{"$f":"Data!L297","v":"SCO"},{"$f":"Data!M297","v":94.8},{"$f":"IF(Data!Q297=\"NOT OPERATIONAL\",\"X\",IF(Data!Q297=\"OPERATIONAL\",\"W\",\"R\"))","v":"W"},{"$f":"Data!N297","v":"A FU "}]
[null,{"$f":"Data!K298","v":"PRESCO"},{"$f":"Data!D298","v":"GB3PT"},{"$f":"Data!F298","v":430.86250000000001},7.5999999999999659,{"$f":"Data!G298","v":438.46249999999998},{"$f":"Data!L298","v":"NOR"},{"$f":"Data!M298","v":94.8},{"$f":"IF(Data!Q298=\"NOT OPERATIONAL\",\"X\",IF(Data!Q298=\"OPERATIONAL\",\"W\",\"R\"))","v":"W"},{"$f":"Data!N298","v":"A "}]
[null,{"$f":"Data!K299","v":"PERTH"},{"$f":"Data!D299","v":"GB3PU"},{"$f":"Data!F299","v":433},1.6000000000000227,{"$f":"Data!G299","v":434.6},{"$f":"Data!L299","v":"SCO"},{"$f":"Data!M299","v":94.8},{"$f":"IF(Data!Q299=\"NOT OPERATIONAL\",\"X\",IF(Data!Q299=\"OPERATIONAL\",\"W\",\"R\"))","v":"W"},{"$f":"Data!N299","v":"A FU "}]
[null,{"$f":"Data!K300","v":"NEWTOWN"},{"$f":"Data!D300","v":"GB3PW"},{"$f":"Data!F300","v":145.77500000000001},-0.59999999999999432,{"$f":"Data!G300","v":145.17500000000001},{"$f":"Data!L300","v":"WM"},{"$f":"Data!M300","v":103.5},{"$f":"IF(Data!Q300=\"NOT OPERATIONAL\",\"X\",IF(Data!Q300=\"OPERATIONAL\",\"W\",\"R\"))","v":"W"},{"$f":"Data!N300","v":"A "}]
[null,{"$f":"Data!K301","v":"BARKWAY"},{"$f":"Data!D301","v":"GB3PX"},{"$f":"Data!F301","v":50.78},1,{"$f":"Data!G301","v":51.78},{"$f":"Data!L301","v":"SE"},{"$f":"Data!M301","v":77},{"$f":"IF(Data!Q301=\"NOT OPERATIONAL\",\"X\",IF(Data!Q301=\"OPERATIONAL\",\"W\",\"R\"))","v":"W"},{"$f":"Data!N301","v":"A "}]
[null,{"$f":"Data!K302","v":"CAMBRIDGE"},{"$f":"Data!D302","v":"GB3PY"},{"$f":"Data!F302","v":430.9},7.6000000000000227,{"$f":"Data!G302","v":438.5},{"$f":"Data!L302","v":"SE"},{"$f":"Data!M302","v":77},{"$f":"IF(Data!Q302=\"NOT OPERATIONAL\",\"X\",IF(Data!Q302=\"OPERATIONAL\",\"W\",\"R\"))","v":"W"},{"$f":"Data!N302","v":"A "}]
[null,{"$f":"Data!K303","v":"DUKINFIELD"},{"$f":"Data!D303","v":"GB3PZ"},{"$f":"Data!F303","v":430.9},7.6000000000000227,{"$f":"Data!G303","v":438.5},{"$f":"Data!L303","v":"NOR"},{"$f":"Data!M303","v":82.5},{"$f":"IF(Data!Q303=\"NOT OPERATIONAL\",\"X\",IF(Data!Q303=\"OPERATIONAL\",\"W\",\"R\"))","v":"W"},{"$f":"Data!N303","v":"A "}]
[null,{"$f":"Data!K304","v":"LLANDRINDOD WELLS"},{"$f":"Data!D304","v":"GB3RA"},{"$f":"Data!F304","v":145.65},-0.59999999999999432,{"$f":"Data!G304","v":145.05000000000001},{"$f":"Data!L304","v":"WM"},{"$f":"Data!M304","v":103.5},{"$f":"IF(Data!Q304=\"NOT OPERATIONAL\",\"X\",IF(Data!Q304=\"OPERATIONAL\",\"W\",\"R\"))","v":"X"},{"$f":"Data!N304","v":"A "}]
[null,{"$f":"Data!K305","v":"BOLSOVER"},{"$f":"Data!D305","v":"GB3RB"},{"$f":"Data!F305","v":433.2},1.6000000000000227,{"$f":"Data!G305","v":434.8},{"$f":"Data!L305","v":"MID"},{"$f":"Data!M305","v":71.900000000000006},{"$f":"IF(Data!Q305=\"NOT OPERATIONAL\",\"X\",IF(Data!Q305=\"OPERATIONAL\",\"W\",\"R\"))","v":"W"},{"$f":"Data!N305","v":"A "}]
[null,{"$f":"Data!K306","v":"CHELTENHAM"},{"$f":"Data!D306","v":"GB3RC"},{"$f":"Data!F306","v":430.86250000000001},7.5999999999999659,{"$f":"Data!G306","v":438.46249999999998},{"$f":"Data!L306","v":"SW"},{"$f":"Data!M306","v":103.5},{"$f":"IF(Data!Q306=\"NOT OPERATIONAL\",\"X\",IF(Data!Q306=\"OPERATIONAL\",\"W\",\"R\"))","v":"W"},{"$f":"Data!N306","v":"A "}]
[null,{"$f":"Data!K307","v":"READING"},{"$f":"Data!D307","v":"GB3RD"},{"$f":"Data!F307","v":145.67500000000001},-0.60000000000002274,{"$f":"Data!G307","v":145.07499999999999},{"$f":"Data!L307","v":"SW"},{"$f":"Data!M307","v":118.8},{"$f":"IF(Data!Q307=\"NOT OPERATIONAL\",\"X\",IF(Data!Q307=\"OPERATIONAL\",\"W\",\"R\"))","v":"W"},{"$f":"Data!N307","v":"A "}]
[null,{"$f":"Data!K308","v":"MAIDSTONE"},{"$f":"Data!D308","v":"GB3RE"},{"$f":"Data!F308","v":433.27499999999998},1.6000000000000227,{"$f":"Data!G308","v":434.875},{"$f":"Data!L308","v":"SE"},{"$f":"Data!M308","v":103.5},{"$f":"IF(Data!Q308=\"NOT OPERATIONAL\",\"X\",IF(Data!Q308=\"OPERATIONAL\",\"W\",\"R\"))","v":"W"},{"$f":"Data!N308","v":"A "}]
[null,{"$f":"Data!K309","v":"ACCRINGTON"},{"$f":"Data!D309","v":"GB3RF"},{"$f":"Data!F309","v":145.77500000000001},-0.59999999999999432,{"$f":"Data!G309","v":145.17500000000001},{"$f":"Data!L309","v":"NOR"},{"$f":"Data!M309","v":82.5},{"$f":"IF(Data!Q309=\"NOT OPERATIONAL\",\"X\",IF(Data!Q309=\"OPERATIONAL\",\"W\",\"R\"))","v":"W"},{"$f":"Data!N309","v":"A "}]
[null,{"$f":"Data!K310","v":"AXMINSTER"},{"$f":"Data!D310","v":"GB3RH"},{"$f":"Data!F310","v":433.27499999999998},1.6000000000000227,{"$f":"Data!G310","v":434.875},{"$f":"Data!L310","v":"SW"},{"$f":"Data!M310","v":94.8},{"$f":"IF(Data!Q310=\"NOT OPERATIONAL\",\"X\",IF(Data!Q310=\"OPERATIONAL\",\"W\",\"R\"))","v":"W"},{"$f":"Data!N310","v":"A "}]
[null,{"$f":"Data!K311","v":"BELFAST"},{"$f":"Data!D311","v":"GB3RK"},{"$f":"Data!F311","v":438.38749999999999},-7.5999999999999659,{"$f":"Data!G311","v":430.78750000000002},{"$f":"Data!L311","v":"NI"},{"$f":"Data!M311","v":88.5},{"$f":"IF(Data!Q311=\"NOT OPERATIONAL\",\"X\",IF(Data!Q311=\"OPERATIONAL\",\"W\",\"R\"))","v":"W"},{"$f":"Data!N311","v":"A "}]
[null,{"$f":"Data!K312","v":"RUSTINGTON"},{"$f":"Data!D312","v":"GB3RL"},{"$f":"Data!F312","v":430.83749999999998},7.6000000000000227,{"$f":"Data!G312","v":438.4375},{"$f":"Data!L312","v":"SE"},{"$f":"Data!M312","v":88.5},{"$f":"IF(Data!Q312=\"NOT OPERATIONAL\",\"X\",IF(Data!Q312=\"OPERATIONAL\",\"W\",\"R\"))","v":"W"},{"$f":"Data!N312","v":"A "}]
[null,{"$f":"Data!K313","v":"HASLINGDEN"},{"$f":"Data!D313","v":"GB3RO"},{"$f":"Data!F313","v":430.82499999999999},7.6000000000000227,{"$f":"Data!G313","v":438.42500000000001},{"$f":"Data!L313","v":"NOR"},{"$f":"Data!M313","v":82.5},{"$f":"IF(Data!Q313=\"NOT OPERATIONAL\",\"X\",IF(Data!Q313=\"OPERATIONAL\",\"W\",\"R\"))","v":"W"},{"$f":"Data!N313","v":"A "}]
[null,{"$f":"Data!K314","v":"DUDLEY"},{"$f":"Data!D314","v":"GB3RR"},{"$f":"Data!F314","v":430.85},7.5999999999999659,{"$f":"Data!G314","v":438.45},{"$f":"Data!L314","v":"MID"},{"$f":"Data!M314","v":67},{"$f":"IF(Data!Q314=\"NOT OPERATIONAL\",\"X\",IF(Data!Q314=\"OPERATIONAL\",\"W\",\"R\"))","v":"W"},{"$f":"Data!N314","v":"A "}]
[null,{"$f":"Data!K315","v":"RICHMOND NORTH YORKSHIRE"},{"$f":"Data!D315","v":"GB3RT"},{"$f":"Data!F315","v":145.58750000000001},-0.59999999999999432,{"$f":"Data!G315","v":144.98750000000001},{"$f":"Data!L315","v":"NOR"},{"$f":"Data!M315","v":118.8},{"$f":"IF(Data!Q315=\"NOT OPERATIONAL\",\"X\",IF(Data!Q315=\"OPERATIONAL\",\"W\",\"R\"))","v":"W"},{"$f":"Data!N315","v":"A "}]
[null,{"$f":"Data!K316","v":"READING"},{"$f":"Data!D316","v":"GB3RU"},{"$f":"Data!F316","v":433.27499999999998},1.6000000000000227,{"$f":"Data!G316","v":434.875},{"$f":"Data!L316","v":"SW"},{"$f":"Data!M316","v":118.8},{"$f":"IF(Data!Q316=\"NOT OPERATIONAL\",\"X\",IF(Data!Q316=\"OPERATIONAL\",\"W\",\"R\"))","v":"W"},{"$f":"Data!N316","v":"A "}]
[null,{"$f":"Data!K317","v":"HASLINGDEN"},{"$f":"Data!D317","v":"GB3RV"},{"$f":"Data!F317","v":145.73750000000001},-0.60000000000002274,{"$f":"Data!G317","v":145.13749999999999},{"$f":"Data!L317","v":"NOR"},{"$f":"Data!M317","v":82.5},{"$f":"IF(Data!Q317=\"NOT OPERATIONAL\",\"X\",IF(Data!Q317=\"OPERATIONAL\",\"W\",\"R\"))","v":"W"},{"$f":"Data!N317","v":"A "}]
[null,{"$f":"Data!K318","v":"WORTHING"},{"$f":"Data!D318","v":"GB3RW"},{"$f":"Data!F318","v":145.6},-0.59999999999999432,{"$f":"Data!G318","v":145},{"$f":"Data!L318","v":"SE"},{"$f":"Data!M318","v":88.5},{"$f":"IF(Data!Q318=\"NOT OPERATIONAL\",\"X\",IF(Data!Q318=\"OPERATIONAL\",\"W\",\"R\"))","v":"W"},{"$f":"Data!N318","v":"A "}]
[null,{"$f":"Data!K319","v":"PRESCO"},{"$f":"Data!D319","v":"GB3RX"},{"$f":"Data!F319","v":430.8125},7.6000000000000227,{"$f":"Data!G319","v":438.41250000000002},{"$f":"Data!L319","v":"NOR"},{"$f":"Data!M319","v":77},{"$f":"IF(Data!Q319=\"NOT OPERATIONAL\",\"X\",IF(Data!Q319=\"OPERATIONAL\",\"W\",\"R\"))","v":"W"},{"$f":"Data!N319","v":"A FU "}]
[null,{"$f":"Data!K320","v":"SWANSEA"},{"$f":"Data!D320","v":"GB3SA"},{"$f":"Data!F320","v":430.875},7.6000000000000227,{"$f":"Data!G320","v":438.47500000000002},{"$f":"Data!L320","v":"WM"},{"$f":"Data!M320","v":94.8},{"$f":"IF(Data!Q320=\"NOT OPERATIONAL\",\"X\",IF(Data!Q320=\"OPERATIONAL\",\"W\",\"R\"))","v":"X"},{"$f":"Data!N320","v":"A "}]
[null,{"$f":"Data!K321","v":"SELKIRK"},{"$f":"Data!D321","v":"GB3SB"},{"$f":"Data!F321","v":145.65},-0.59999999999999432,{"$f":"Data!G321","v":145.05000000000001},{"$f":"Data!L321","v":"SCO"},{"$f":"Data!M321","v":118.8},{"$f":"IF(Data!Q321=\"NOT OPERATIONAL\",\"X\",IF(Data!Q321=\"OPERATIONAL\",\"W\",\"R\"))","v":"W"},{"$f":"Data!N321","v":"A "}]
[null,{"$f":"Data!K322","v":"BURTON-UPON-TRENT"},{"$f":"Data!D322","v":"GB3SC"},{"$f":"Data!F322","v":430.86250000000001},7.5999999999999659,{"$f":"Data!G322","v":438.46249999999998},{"$f":"Data!L322","v":"MID"},{"$f":"Data!M322","v":67},{"$f":"IF(Data!Q322=\"NOT OPERATIONAL\",\"X\",IF(Data!Q322=\"OPERATIONAL\",\"W\",\"R\"))","v":"W"},{"$f":"Data!N322","v":"A "}]
[null,{"$f":"Data!K323","v":"WEYMOUTH"},{"$f":"Data!D323","v":"GB3SD"},{"$f":"Data!F323","v":433.35},1.5999999999999659,{"$f":"Data!G323","v":434.95},{"$f":"Data!L323","v":"SW"},{"$f":"Data!M323","v":71.900000000000006},{"$f":"IF(Data!Q323=\"NOT OPERATIONAL\",\"X\",IF(Data!Q323=\"OPERATIONAL\",\"W\",\"R\"))","v":"W"},{"$f":"Data!N323","v":"A "}]
[null,{"$f":"Data!K324","v":"PERTH"},{"$f":"Data!D324","v":"GB3SF"},{"$f":"Data!F324","v":145.625},-0.59999999999999432,{"$f":"Data!G324","v":145.02500000000001},{"$f":"Data!L324","v":"SCO"},{"$f":"Data!M324","v":0},{"$f":"IF(Data!Q324=\"NOT OPERATIONAL\",\"X\",IF(Data!Q324=\"OPERATIONAL\",\"W\",\"R\"))","v":"W"},{"$f":"Data!N324","v":"FU "}]
[null,{"$f":"Data!K325","v":"STROUD"},{"$f":"Data!D325","v":"GB3SG"},{"$f":"Data!F325","v":430.91250000000002},7.5999999999999659,{"$f":"Data!G325","v":438.51249999999999},{"$f":"Data!L325","v":"SW"},{"$f":"Data!M325","v":118.8},{"$f":"IF(Data!Q325=\"NOT OPERATIONAL\",\"X\",IF(Data!Q325=\"OPERATIONAL\",\"W\",\"R\"))","v":"W"},{"$f":"Data!N325","v":"A "}]
[null,{"$f":"Data!K326","v":"SOUTHAMPTON"},{"$f":"Data!D326","v":"GB3SH"},{"$f":"Data!F326","v":145.66249999999999},-0.59999999999999432,{"$f":"Data!G326","v":145.0625},{"$f":"Data!L326","v":"SW"},{"$f":"Data!M326","v":71.900000000000006},{"$f":"IF(Data!Q326=\"NOT OPERATIONAL\",\"X\",IF(Data!Q326=\"OPERATIONAL\",\"W\",\"R\"))","v":"W"},{"$f":"Data!N326","v":"A "}]
[null,{"$f":"Data!K327","v":"HELSTON"},{"$f":"Data!D327","v":"GB3SI"},{"$f":"Data!F327","v":145.625},-0.59999999999999432,{"$f":"Data!G327","v":145.02500000000001},{"$f":"Data!L327","v":"SW"},{"$f":"Data!M327","v":77},{"$f":"IF(Data!Q327=\"NOT OPERATIONAL\",\"X\",IF(Data!Q327=\"OPERATIONAL\",\"W\",\"R\"))","v":"W"},{"$f":"Data!N327","v":"A "}]
[null,{"$f":"Data!K328","v":"NORTHWICH"},{"$f":"Data!D328","v":"GB3SJ"},{"$f":"Data!F328","v":145.6875},-0.59999999999999432,{"$f":"Data!G328","v":145.08750000000001},{"$f":"Data!L328","v":"NOR"},{"$f":"Data!M328","v":103.5},{"$f":"IF(Data!Q328=\"NOT OPERATIONAL\",\"X\",IF(Data!Q328=\"OPERATIONAL\",\"W\",\"R\"))","v":"W"},{"$f":"Data!N328","v":"A "}]
[null,{"$f":"Data!K329","v":"CANTERBURY"},{"$f":"Data!D329","v":"GB3SK"},{"$f":"Data!F329","v":433.15},{"$f":"F329-D329","v":1.6000000000000227},{"$f":"Data!G329","v":434.75},{"$f":"Data!L329","v":"SE"},{"$f":"Data!M329","v":103.5},{"$f":"IF(Data!Q329=\"NOT OPERATIONAL\",\"X\",IF(Data!Q329=\"OPERATIONAL\",\"W\",\"R\"))","v":"W"},{"$f":"Data!N329","v":"A "}]
[null,{"$f":"Data!K330","v":"KILSYTH"},{"$f":"Data!D330","v":"GB3SL"},{"$f":"Data!F330","v":50.73},0.5,{"$f":"Data!G330","v":51.23},{"$f":"Data!L330","v":"SCO"},{"$f":"Data!M330","v":103.5},{"$f":"IF(Data!Q330=\"NOT OPERATIONAL\",\"X\",IF(Data!Q330=\"OPERATIONAL\",\"W\",\"R\"))","v":"W"},{"$f":"Data!N330","v":"A "}]
[null,{"$f":"Data!K331","v":"STOKE ON TRENT"},{"$f":"Data!D331","v":"GB3SM"},{"$f":"Data!F331","v":433.32499999999999},1.6000000000000227,{"$f":"Data!G331","v":434.92500000000001},{"$f":"Data!L331","v":"MID"},{"$f":"Data!M331","v":103.5},{"$f":"IF(Data!Q331=\"NOT OPERATIONAL\",\"X\",IF(Data!Q331=\"OPERATIONAL\",\"W\",\"R\"))","v":"W"},{"$f":"Data!N331","v":"A "}]
[null,{"$f":"Data!K332","v":"ALTON HANTS"},{"$f":"Data!D332","v":"GB3SN"},{"$f":"Data!F332","v":145.72499999999999},-0.59999999999999432,{"$f":"Data!G332","v":145.125},{"$f":"Data!L332","v":"SW"},{"$f":"Data!M332","v":71.900000000000006},{"$f":"IF(Data!Q332=\"NOT OPERATIONAL\",\"X\",IF(Data!Q332=\"OPERATIONAL\",\"W\",\"R\"))","v":"W"},{"$f":"Data!N332","v":"A "}]
[null,{"$f":"Data!K333","v":"WITHERNSEA"},{"$f":"Data!D333","v":"GB3SO"},{"$f":"Data!F333","v":433},1.6000000000000227,{"$f":"Data!G333","v":434.6},{"$f":"Data!L333","v":"NOR"},{"$f":"Data!M333","v":71.900000000000006},{"$f":"IF(Data!Q333=\"NOT OPERATIONAL\",\"X\",IF(Data!Q333=\"OPERATIONAL\",\"W\",\"R\"))","v":"X"},{"$f":"Data!N333","v":"A DM DS FU "}]
[null,{"$f":"Data!K334","v":"PEMBROKE"},{"$f":"Data!D334","v":"GB3SP"},{"$f":"Data!F334","v":433.1},1.5999999999999659,{"$f":"Data!G334","v":434.7},{"$f":"Data!L334","v":"WM"},{"$f":"Data!M334","v":94.8},{"$f":"IF(Data!Q334=\"NOT OPERATIONAL\",\"X\",IF(Data!Q334=\"OPERATIONAL\",\"W\",\"R\"))","v":"W"},{"$f":"Data!N334","v":"A FU "}]
[null,{"$f":"Data!K335","v":"SKEGNESS"},{"$f":"Data!D335","v":"GB3SR"},{"$f":"Data!F335","v":430.91250000000002},7.5999999999999659,{"$f":"Data!G335","v":438.51249999999999},{"$f":"Data!L335","v":"EA"},{"$f":"Data!M335","v":71.900000000000006},{"$f":"IF(Data!Q335=\"NOT OPERATIONAL\",\"X\",IF(Data!Q335=\"OPERATIONAL\",\"W\",\"R\"))","v":"W"},{"$f":"Data!N335","v":"A "}]
[null,{"$f":"Data!K336","v":"ELGIN MORAY"},{"$f":"Data!D336","v":"GB3SS"},{"$f":"Data!F336","v":145.6},-0.59999999999999432,{"$f":"Data!G336","v":145},{"$f":"Data!L336","v":"SCO"},{"$f":"Data!M336","v":67},{"$f":"IF(Data!Q336=\"NOT OPERATIONAL\",\"X\",IF(Data!Q336=\"OPERATIONAL\",\"W\",\"R\"))","v":"W"},{"$f":"Data!N336","v":"A FU "}]
[null,{"$f":"Data!K337","v":"STOKE ON TRENT"},{"$f":"Data!D337","v":"GB3ST"},{"$f":"Data!F337","v":433.22500000000002},1.5999999999999659,{"$f":"Data!G337","v":434.82499999999999},{"$f":"Data!L337","v":"MID"},{"$f":"Data!M337","v":103.5},{"$f":"IF(Data!Q337=\"NOT OPERATIONAL\",\"X\",IF(Data!Q337=\"OPERATIONAL\",\"W\",\"R\"))","v":"W"},{"$f":"Data!N337","v":"A "}]
[null,{"$f":"Data!K338","v":"SOUTHAMPTON"},{"$f":"Data!D338","v":"GB3SU"},{"$f":"Data!F338","v":433.2},1.6000000000000227,{"$f":"Data!G338","v":434.8},{"$f":"Data!L338","v":"SW"},{"$f":"Data!M338","v":71.900000000000006},{"$f":"IF(Data!Q338=\"NOT OPERATIONAL\",\"X\",IF(Data!Q338=\"OPERATIONAL\",\"W\",\"R\"))","v":"W"},{"$f":"Data!N338","v":"A "}]
[null,{"$f":"Data!K339","v":"STAFFORD"},{"$f":"Data!D339","v":"GB3SV"},{"$f":"Data!F339","v":145.61250000000001},-0.60000000000002274,{"$f":"Data!G339","v":145.01249999999999},{"$f":"Data!L339","v":"MID"},{"$f":"Data!M339","v":94.8},{"$f":"IF(Data!Q339=\"NOT OPERATIONAL\",\"X\",IF(Data!Q339=\"OPERATIONAL\",\"W\",\"R\"))","v":"W"},{"$f":"Data!N339","v":"A "}]
[null,{"$f":"Data!K340","v":"SIDMOUTH"},{"$f":"Data!D340","v":"GB3SW"},{"$f":"Data!F340","v":145.71250000000001},-0.59999999999999432,{"$f":"Data!G340","v":145.11250000000001},{"$f":"Data!L340","v":"SW"},{"$f":"Data!M340","v":77},{"$f":"IF(Data!Q340=\"NOT OPERATIONAL\",\"X\",IF(Data!Q340=\"OPERATIONAL\",\"W\",\"R\"))","v":"X"},{"$f":"Data!N340","v":"A FU "}]
[null,{"$f":"Data!K341","v":"STOKE ON TRENT"},{"$f":"Data!D341","v":"GB3SX"},{"$f":"Data!F341","v":50.79},0.5,{"$f":"Data!G341","v":51.29},{"$f":"Data!L341","v":"MID"},{"$f":"Data!M341","v":103.5},{"$f":"IF(Data!Q341=\"NOT OPERATIONAL\",\"X\",IF(Data!Q341=\"OPERATIONAL\",\"W\",\"R\"))","v":"W"},{"$f":"Data!N341","v":"A "}]
[null,{"$f":"Data!K342","v":"BARNSLEY"},{"$f":"Data!D342","v":"GB3SY"},{"$f":"Data!F342","v":433.15},1.6000000000000227,{"$f":"Data!G342","v":434.75},{"$f":"Data!L342","v":"NOR"},{"$f":"Data!M342","v":71.900000000000006},{"$f":"IF(Data!Q342=\"NOT OPERATIONAL\",\"X\",IF(Data!Q342=\"OPERATIONAL\",\"W\",\"R\"))","v":"W"},{"$f":"Data!N342","v":"A DS FU "}]
[null,{"$f":"Data!K343","v":"TONDU  BRIDGEND"},{"$f":"Data!D343","v":"GB3TC"},{"$f":"Data!F343","v":430.9375},7.6000000000000227,{"$f":"Data!G343","v":438.53750000000002},{"$f":"Data!L343","v":"WM"},{"$f":"Data!M343","v":94.8},{"$f":"IF(Data!Q343=\"NOT OPERATIONAL\",\"X\",IF(Data!Q343=\"OPERATIONAL\",\"W\",\"R\"))","v":"X"},{"$f":"Data!N343","v":"A "}]
[null,{"$f":"Data!K344","v":"SWINDON"},{"$f":"Data!D344","v":"GB3TD"},{"$f":"Data!F344","v":438.38749999999999},-7.5999999999999659,{"$f":"Data!G344","v":430.78750000000002},{"$f":"Data!L344","v":"SW"},{"$f":"Data!M344","v":118.8},{"$f":"IF(Data!Q344=\"NOT OPERATIONAL\",\"X\",IF(Data!Q344=\"OPERATIONAL\",\"W\",\"R\"))","v":"W"},{"$f":"Data!N344","v":"A "}]
[null,{"$f":"Data!K345","v":"CLACTON ON SEA"},{"$f":"Data!D345","v":"GB3TE"},{"$f":"Data!F345","v":145.61250000000001},-0.60000000000002274,{"$f":"Data!G345","v":145.01249999999999},{"$f":"Data!L345","v":"EA"},{"$f":"Data!M345","v":67},{"$f":"IF(Data!Q345=\"NOT OPERATIONAL\",\"X\",IF(Data!Q345=\"OPERATIONAL\",\"W\",\"R\"))","v":"W"},{"$f":"Data!N345","v":"A "}]
[null,{"$f":"Data!K346","v":"TELFORD"},{"$f":"Data!D346","v":"GB3TF"},{"$f":"Data!F346","v":433.2},1.6000000000000227,{"$f":"Data!G346","v":434.8},{"$f":"Data!L346","v":"MID"},{"$f":"Data!M346","v":103.5},{"$f":"IF(Data!Q346=\"NOT OPERATIONAL\",\"X\",IF(Data!Q346=\"OPERATIONAL\",\"W\",\"R\"))","v":"W"},{"$f":"Data!N346","v":"A FU "}]
[null,{"$f":"Data!K347","v":"TAMWORTH"},{"$f":"Data!D347","v":"GB3TH"},{"$f":"Data!F347","v":433.375},1.6000000000000227,{"$f":"Data!G347","v":434.97500000000002},{"$f":"Data!L347","v":"MID"},{"$f":"Data!M347","v":67},{"$f":"IF(Data!Q347=\"NOT OPERATIONAL\",\"X\",IF(Data!Q347=\"OPERATIONAL\",\"W\",\"R\"))","v":"W"},{"$f":"Data!N347","v":"A FU "}]
[null,{"$f":"Data!K348","v":"HEXHAM"},{"$f":"Data!D348","v":"GB3TJ"},{"$f":"Data!F348","v":433.3},1.5999999999999659,{"$f":"Data!G348","v":434.9},{"$f":"Data!L348","v":"NOR"},{"$f":"Data!M348","v":118.8},{"$f":"IF(Data!Q348=\"NOT OPERATIONAL\",\"X\",IF(Data!Q348=\"OPERATIONAL\",\"W\",\"R\"))","v":"X"},{"$f":"Data!N348","v":"A FU "}]
[null,{"$f":"Data!K349","v":"NOTTINGHAM"},{"$f":"Data!D349","v":"GB3TK"},{"$f":"Data!F349","v":433.07499999999999},1.6000000000000227,{"$f":"Data!G349","v":434.67500000000001},{"$f":"Data!L349","v":"MID"},{"$f":"Data!M349","v":71.900000000000006},{"$f":"IF(Data!Q349=\"NOT OPERATIONAL\",\"X\",IF(Data!Q349=\"OPERATIONAL\",\"W\",\"R\"))","v":"W"},{"$f":"Data!N349","v":"A "}]
[null,{"$f":"Data!K350","v":"SHIPLEY"},{"$f":"Data!D350","v":"GB3TP"},{"$f":"Data!F350","v":145.72499999999999},-0.59999999999999432,{"$f":"Data!G350","v":145.125},{"$f":"Data!L350","v":"NOR"},{"$f":"Data!M350","v":82.5},{"$f":"IF(Data!Q350=\"NOT OPERATIONAL\",\"X\",IF(Data!Q350=\"OPERATIONAL\",\"W\",\"R\"))","v":"W"},{"$f":"Data!N350","v":"A "}]
[null,{"$f":"Data!K351","v":"TORQUAY"},{"$f":"Data!D351","v":"GB3TR"},{"$f":"Data!F351","v":145.65},-0.59999999999999432,{"$f":"Data!G351","v":145.05000000000001},{"$f":"Data!L351","v":"SW"},{"$f":"Data!M351","v":94.8},{"$f":"IF(Data!Q351=\"NOT OPERATIONAL\",\"X\",IF(Data!Q351=\"OPERATIONAL\",\"W\",\"R\"))","v":"W"},{"$f":"Data!N351","v":"A "}]
[null,{"$f":"Data!K352","v":"SUNDERLAND"},{"$f":"Data!D352","v":"GB3TS"},{"$f":"Data!F352","v":433.17500000000001},1.5999999999999659,{"$f":"Data!G352","v":434.77499999999998},{"$f":"Data!L352","v":"NOR"},{"$f":"Data!M352","v":118.8},{"$f":"IF(Data!Q352=\"NOT OPERATIONAL\",\"X\",IF(Data!Q352=\"OPERATIONAL\",\"W\",\"R\"))","v":"W"},{"$f":"Data!N352","v":"A FU "}]
[null,{"$f":"Data!K353","v":"TRING"},{"$f":"Data!D353","v":"GB3TU"},{"$f":"Data!F353","v":433.22500000000002},1.5999999999999659,{"$f":"Data!G353","v":434.82499999999999},{"$f":"Data!L353","v":"SE"},{"$f":"Data!M353","v":77},{"$f":"IF(Data!Q353=\"NOT OPERATIONAL\",\"X\",IF(Data!Q353=\"OPERATIONAL\",\"W\",\"R\"))","v":"W"},{"$f":"Data!N353","v":"A "}]
[null,{"$f":"Data!K354","v":"GATESHEAD"},{"$f":"Data!D354","v":"GB3TW"},{"$f":"Data!F354","v":145.72499999999999},-0.59999999999999432,{"$f":"Data!G354","v":145.125},{"$f":"Data!L354","v":"NOR"},{"$f":"Data!M354","v":118.8},{"$f":"IF(Data!Q354=\"NOT OPERATIONAL\",\"X\",IF(Data!Q354=\"OPERATIONAL\",\"W\",\"R\"))","v":"X"},{"$f":"Data!N354","v":"A FU "}]
[null,{"$f":"Data!K355","v":"NORWICH"},{"$f":"Data!D355","v":"GB3TX"},{"$f":"Data!F355","v":29.65},-9.9999999999997868E-2,{"$f":"Data!G355","v":29.55},{"$f":"Data!L355","v":"EA"},{"$f":"Data!M355","v":94.8},{"$f":"IF(Data!Q355=\"NOT OPERATIONAL\",\"X\",IF(Data!Q355=\"OPERATIONAL\",\"W\",\"R\"))","v":"X"},{"$f":"Data!N355","v":"A "}]
[null,{"$f":"Data!K356","v":"WYMONDHAM"},{"$f":"Data!D356","v":"GB3TX"},{"$f":"Data!F356","v":430.8125},7.6000000000000227,{"$f":"Data!G356","v":438.41250000000002},{"$f":"Data!L356","v":"EA"},{"$f":"Data!M356","v":94.8},{"$f":"IF(Data!Q356=\"NOT OPERATIONAL\",\"X\",IF(Data!Q356=\"OPERATIONAL\",\"W\",\"R\"))","v":"W"},{"$f":"Data!N356","v":"A "}]
[null,{"$f":"Data!K357","v":"WYMONDHAM"},{"$f":"Data!D357","v":"GB3TX"},{"$f":"Data!F357","v":145.6},-0.59999999999999432,{"$f":"Data!G357","v":145},{"$f":"Data!L357","v":"EA"},{"$f":"Data!M357","v":94.8},{"$f":"IF(Data!Q357=\"NOT OPERATIONAL\",\"X\",IF(Data!Q357=\"OPERATIONAL\",\"W\",\"R\"))","v":"X"},{"$f":"Data!N357","v":"A "}]
[null,{"$f":"Data!K358","v":"GUILDFORD"},{"$f":"Data!D358","v":"GB3TY"},{"$f":"Data!F358","v":145.57499999999999},-0.59999999999999432,{"$f":"Data!G358","v":144.97499999999999},{"$f":"Data!L358","v":"SW"},{"$f":"Data!M358","v":88.5},{"$f":"IF(Data!Q358=\"NOT OPERATIONAL\",\"X\",IF(Data!Q358=\"OPERATIONAL\",\"W\",\"R\"))","v":"W"},{"$f":"Data!N358","v":"A "}]
[null,{"$f":"Data!K359","v":"BATH AVON"},{"$f":"Data!D359","v":"GB3UB"},{"$f":"Data!F359","v":433.1},1.5999999999999659,{"$f":"Data!G359","v":434.7},{"$f":"Data!L359","v":"SW"},{"$f":"Data!M359","v":118.8},{"$f":"IF(Data!Q359=\"NOT OPERATIONAL\",\"X\",IF(Data!Q359=\"OPERATIONAL\",\"W\",\"R\"))","v":"W"},{"$f":"Data!N359","v":"A "}]
[null,{"$f":"Data!K360","v":"BELFAST  N.I."},{"$f":"Data!D360","v":"GB3UL"},{"$f":"Data!F360","v":433.05},1.5999999999999659,{"$f":"Data!G360","v":434.65},{"$f":"Data!L360","v":"NI"},{"$f":"Data!M360","v":110.9},{"$f":"IF(Data!Q360=\"NOT OPERATIONAL\",\"X\",IF(Data!Q360=\"OPERATIONAL\",\"W\",\"R\"))","v":"W"},{"$f":"Data!N360","v":"A "}]
[null,{"$f":"Data!K361","v":"MARKFIELD"},{"$f":"Data!D361","v":"GB3UM"},{"$f":"Data!F361","v":50.74},0.5,{"$f":"Data!G361","v":51.24},{"$f":"Data!L361","v":"MID"},{"$f":"Data!M361","v":77},{"$f":"IF(Data!Q361=\"NOT OPERATIONAL\",\"X\",IF(Data!Q361=\"OPERATIONAL\",\"W\",\"R\"))","v":"W"},{"$f":"Data!N361","v":"A "}]
[null,{"$f":"Data!K362","v":"WREXHAM"},{"$f":"Data!D362","v":"GB3UO"},{"$f":"Data!F362","v":430.95},7.6000000000000227,{"$f":"Data!G362","v":438.55},{"$f":"Data!L362","v":"WM"},{"$f":"Data!M362","v":110.9},{"$f":"IF(Data!Q362=\"NOT OPERATIONAL\",\"X\",IF(Data!Q362=\"OPERATIONAL\",\"W\",\"R\"))","v":"W"},{"$f":"Data!N362","v":"A FU "}]
[null,{"$f":"Data!K363","v":"FISHGUARD"},{"$f":"Data!D363","v":"GB3UP"},{"$f":"Data!F363","v":430.91250000000002},7.5999999999999659,{"$f":"Data!G363","v":438.51249999999999},{"$f":"Data!L363","v":"WM"},{"$f":"Data!M363","v":94.8},{"$f":"IF(Data!Q363=\"NOT OPERATIONAL\",\"X\",IF(Data!Q363=\"OPERATIONAL\",\"W\",\"R\"))","v":"W"},{"$f":"Data!N363","v":"A "}]
[null,{"$f":"Data!K364","v":"SHEFFIELD"},{"$f":"Data!D364","v":"GB3US"},{"$f":"Data!F364","v":433},1.6000000000000227,{"$f":"Data!G364","v":434.6},{"$f":"Data!L364","v":"NOR"},{"$f":"Data!M364","v":103.5},{"$f":"IF(Data!Q364=\"NOT OPERATIONAL\",\"X\",IF(Data!Q364=\"OPERATIONAL\",\"W\",\"R\"))","v":"W"},{"$f":"Data!N364","v":"A "}]
[null,{"$f":"Data!K365","v":"BRILL"},{"$f":"Data!D365","v":"GB3VA"},{"$f":"Data!F365","v":145.69999999999999},-0.59999999999999432,{"$f":"Data!G365","v":145.1},{"$f":"Data!L365","v":"SE"},{"$f":"Data!M365","v":118.8},{"$f":"IF(Data!Q365=\"NOT OPERATIONAL\",\"X\",IF(Data!Q365=\"OPERATIONAL\",\"W\",\"R\"))","v":"W"},{"$f":"Data!N365","v":"A "}]
[null,{"$f":"Data!K366","v":"DUFTON"},{"$f":"Data!D366","v":"GB3VE"},{"$f":"Data!F366","v":433.1},1.5999999999999659,{"$f":"Data!G366","v":434.7},{"$f":"Data!L366","v":"NOR"},{"$f":"Data!M366","v":77},{"$f":"IF(Data!Q366=\"NOT OPERATIONAL\",\"X\",IF(Data!Q366=\"OPERATIONAL\",\"W\",\"R\"))","v":"W"},{"$f":"Data!N366","v":"A "}]
[null,{"$f":"Data!K367","v":"WELWYN GARDEN CITY"},{"$f":"Data!D367","v":"GB3VH"},{"$f":"Data!F367","v":433.32499999999999},1.6000000000000227,{"$f":"Data!G367","v":434.92500000000001},{"$f":"Data!L367","v":"SE"},{"$f":"Data!M367","v":82.5},{"$f":"IF(Data!Q367=\"NOT OPERATIONAL\",\"X\",IF(Data!Q367=\"OPERATIONAL\",\"W\",\"R\"))","v":"X"},{"$f":"Data!N367","v":"A "}]
[null,{"$f":"Data!K368","v":"DUDLEY"},{"$f":"Data!D368","v":"GB3VI"},{"$f":"Data!F368","v":50.86},0.5,{"$f":"Data!G368","v":51.36},{"$f":"Data!L368","v":"MID"},{"$f":"Data!M368","v":67},{"$f":"IF(Data!Q368=\"NOT OPERATIONAL\",\"X\",IF(Data!Q368=\"OPERATIONAL\",\"W\",\"R\"))","v":"W"},{"$f":"Data!N368","v":"A "}]
[null,{"$f":"Data!K369","v":"TENBURY WELLS"},{"$f":"Data!D369","v":"GB3VM"},{"$f":"Data!F369","v":145.61250000000001},-0.60000000000002274,{"$f":"Data!G369","v":145.01249999999999},{"$f":"Data!L369","v":"MID"},{"$f":"Data!M369","v":103.5},{"$f":"IF(Data!Q369=\"NOT OPERATIONAL\",\"X\",IF(Data!Q369=\"OPERATIONAL\",\"W\",\"R\"))","v":"W"},{"$f":"Data!N369","v":"A FU "}]
[null,{"$f":"Data!K370","v":"LUDLOW"},{"$f":"Data!D370","v":"GB3VN"},{"$f":"Data!F370","v":430.92500000000001},7.5999999999999659,{"$f":"Data!G370","v":438.52499999999998},{"$f":"Data!L370","v":"MID"},{"$f":"Data!M370","v":103.5},{"$f":"IF(Data!Q370=\"NOT OPERATIONAL\",\"X\",IF(Data!Q370=\"OPERATIONAL\",\"W\",\"R\"))","v":"W"},{"$f":"Data!N370","v":"A FU "}]
[null,{"$f":"Data!K371","v":"WREXHAM"},{"$f":"Data!D371","v":"GB3VO"},{"$f":"Data!F371","v":145.63749999999999},-0.59999999999999432,{"$f":"Data!G371","v":145.03749999999999},{"$f":"Data!L371","v":"WM"},{"$f":"Data!M371","v":110.9},{"$f":"IF(Data!Q371=\"NOT OPERATIONAL\",\"X\",IF(Data!Q371=\"OPERATIONAL\",\"W\",\"R\"))","v":"W"},{"$f":"Data!N371","v":"A FU "}]
[null,{"$f":"Data!K372","v":"HARPENDEN"},{"$f":"Data!D372","v":"GB3VR"},{"$f":"Data!F372","v":430.8125},7.6000000000000227,{"$f":"Data!G372","v":438.41250000000002},{"$f":"Data!L372","v":"SE"},{"$f":"Data!M372","v":67},{"$f":"IF(Data!Q372=\"NOT OPERATIONAL\",\"X\",IF(Data!Q372=\"OPERATIONAL\",\"W\",\"R\"))","v":"W"},{"$f":"Data!N372","v":"A "}]
[null,{"$f":"Data!K373","v":"TRULL"},{"$f":"Data!D373","v":"GB3VS"},{"$f":"Data!F373","v":430.83749999999998},7.6000000000000227,{"$f":"Data!G373","v":438.4375},{"$f":"Data!L373","v":"SW"},{"$f":"Data!M373","v":94.8},{"$f":"IF(Data!Q373=\"NOT OPERATIONAL\",\"X\",IF(Data!Q373=\"OPERATIONAL\",\"W\",\"R\"))","v":"W"},{"$f":"Data!N373","v":"A "}]
[null,{"$f":"Data!K374","v":"STOKE ON TRENT"},{"$f":"Data!D374","v":"GB3VT"},{"$f":"Data!F374","v":145.72499999999999},-0.59999999999999432,{"$f":"Data!G374","v":145.125},{"$f":"Data!L374","v":"MID"},{"$f":"Data!M374","v":103.5},{"$f":"IF(Data!Q374=\"NOT OPERATIONAL\",\"X\",IF(Data!Q374=\"OPERATIONAL\",\"W\",\"R\"))","v":"W"},{"$f":"Data!N374","v":"DS "}]
[null,{"$f":"Data!K375","v":"STEVENAGE OLD TOWN"},{"$f":"Data!D375","v":"GB3VV"},{"$f":"Data!F375","v":433.27499999999998},5,{"$f":"Data!G375","v":438.27499999999998},{"$f":"Data!L375","v":"SE"},{"$f":"Data!M375","v":82.5},{"$f":"IF(Data!Q375=\"NOT OPERATIONAL\",\"X\",IF(Data!Q375=\"OPERATIONAL\",\"W\",\"R\"))","v":"X"},{"$f":"Data!N375","v":"A "}]
[null,{"$f":"Data!K376","v":"DALRY"},{"$f":"Data!D376","v":"GB3WA"},{"$f":"Data!F376","v":430.875},7.6000000000000227,{"$f":"Data!G376","v":438.47500000000002},{"$f":"Data!L376","v":"SCO"},{"$f":"Data!M376","v":103.5},{"$f":"IF(Data!Q376=\"NOT OPERATIONAL\",\"X\",IF(Data!Q376=\"OPERATIONAL\",\"W\",\"R\"))","v":"W"},{"$f":"Data!N376","v":"A "}]
[null,{"$f":"Data!K377","v":"WESTON-SUPER-MARE"},{"$f":"Data!D377","v":"GB3WB"},{"$f":"Data!F377","v":433.3},1.5999999999999659,{"$f":"Data!G377","v":434.9},{"$f":"Data!L377","v":"SW"},{"$f":"Data!M377","v":94.8},{"$f":"IF(Data!Q377=\"NOT OPERATIONAL\",\"X\",IF(Data!Q377=\"OPERATIONAL\",\"W\",\"R\"))","v":"W"},{"$f":"Data!N377","v":"A "}]
[null,{"$f":"Data!K378","v":"IVYBRIDGE"},{"$f":"Data!D378","v":"GB3WD"},{"$f":"Data!F378","v":145.69999999999999},-0.59999999999999432,{"$f":"Data!G378","v":145.1},{"$f":"Data!L378","v":"SW"},{"$f":"Data!M378","v":77},{"$f":"IF(Data!Q378=\"NOT OPERATIONAL\",\"X\",IF(Data!Q378=\"OPERATIONAL\",\"W\",\"R\"))","v":"W"},{"$f":"Data!N378","v":"A "}]
[null,{"$f":"Data!K379","v":"WESTON-SUPER-MARE"},{"$f":"Data!D379","v":"GB3WE"},{"$f":"Data!F379","v":145.6875},-0.59999999999999432,{"$f":"Data!G379","v":145.08750000000001},{"$f":"Data!L379","v":"SW"},{"$f":"Data!M379","v":94.8},{"$f":"IF(Data!Q379=\"NOT OPERATIONAL\",\"X\",IF(Data!Q379=\"OPERATIONAL\",\"W\",\"R\"))","v":"W"},{"$f":"Data!N379","v":"A DM DS "}]
[null,{"$f":"Data!K380","v":"OTLEY"},{"$f":"Data!D380","v":"GB3WF"},{"$f":"Data!F380","v":433.35},1.5999999999999659,{"$f":"Data!G380","v":434.95},{"$f":"Data!L380","v":"NOR"},{"$f":"Data!M380","v":82.5},{"$f":"IF(Data!Q380=\"NOT OPERATIONAL\",\"X\",IF(Data!Q380=\"OPERATIONAL\",\"W\",\"R\"))","v":"W"},{"$f":"Data!N380","v":"A FU "}]
[null,{"$f":"Data!K381","v":"SWINDON"},{"$f":"Data!D381","v":"GB3WH"},{"$f":"Data!F381","v":145.65},-0.59999999999999432,{"$f":"Data!G381","v":145.05000000000001},{"$f":"Data!L381","v":"SW"},{"$f":"Data!M381","v":118.8},{"$f":"IF(Data!Q381=\"NOT OPERATIONAL\",\"X\",IF(Data!Q381=\"OPERATIONAL\",\"W\",\"R\"))","v":"W"},{"$f":"Data!N381","v":"A "}]
[null,{"$f":"Data!K382","v":"WISBECH"},{"$f":"Data!D382","v":"GB3WI"},{"$f":"Data!F382","v":433.375},1.6000000000000227,{"$f":"Data!G382","v":434.97500000000002},{"$f":"Data!L382","v":"EA"},{"$f":"Data!M382","v":94.8},{"$f":"IF(Data!Q382=\"NOT OPERATIONAL\",\"X\",IF(Data!Q382=\"OPERATIONAL\",\"W\",\"R\"))","v":"W"},{"$f":"Data!N382","v":"A FU "}]
[null,{"$f":"Data!K383","v":"LEAMINGTON SPA"},{"$f":"Data!D383","v":"GB3WK"},{"$f":"Data!F383","v":145.77500000000001},-0.59999999999999432,{"$f":"Data!G383","v":145.17500000000001},{"$f":"Data!L383","v":"MID"},{"$f":"Data!M383","v":67},{"$f":"IF(Data!Q383=\"NOT OPERATIONAL\",\"X\",IF(Data!Q383=\"OPERATIONAL\",\"W\",\"R\"))","v":"W"},{"$f":"Data!N383","v":"A "}]
[null,{"$f":"Data!K384","v":"WYTHALL"},{"$f":"Data!D384","v":"GB3WL"},{"$f":"Data!F384","v":430.95},7.6000000000000227,{"$f":"Data!G384","v":438.55},{"$f":"Data!L384","v":"MID"},{"$f":"Data!M384","v":67},{"$f":"IF(Data!Q384=\"NOT OPERATIONAL\",\"X\",IF(Data!Q384=\"OPERATIONAL\",\"W\",\"R\"))","v":"W"},{"$f":"Data!N384","v":"A DS FU "}]
[null,{"$f":"Data!K385","v":"LONGBRIDGE"},{"$f":"Data!D385","v":"GB3WM"},{"$f":"Data!F385","v":433.05},1.5999999999999659,{"$f":"Data!G385","v":434.65},{"$f":"Data!L385","v":"MID"},{"$f":"Data!M385","v":67},{"$f":"IF(Data!Q385=\"NOT OPERATIONAL\",\"X\",IF(Data!Q385=\"OPERATIONAL\",\"W\",\"R\"))","v":"W"},{"$f":"Data!N385","v":"A FU "}]
[null,{"$f":"Data!K386","v":"WOLVERHAMPTON"},{"$f":"Data!D386","v":"GB3WN"},{"$f":"Data!F386","v":438.38749999999999},-7.5999999999999659,{"$f":"Data!G386","v":430.78750000000002},{"$f":"Data!L386","v":"MID"},{"$f":"Data!M386","v":67},{"$f":"IF(Data!Q386=\"NOT OPERATIONAL\",\"X\",IF(Data!Q386=\"OPERATIONAL\",\"W\",\"R\"))","v":"R"},{"$f":"Data!N386","v":"A "}]
[null,{"$f":"Data!K387","v":"WORTHING"},{"$f":"Data!D387","v":"GB3WO"},{"$f":"Data!F387","v":430.97500000000002},7.5999999999999659,{"$f":"Data!G387","v":438.57499999999999},{"$f":"Data!L387","v":"SE"},{"$f":"Data!M387","v":88.5},{"$f":"IF(Data!Q387=\"NOT OPERATIONAL\",\"X\",IF(Data!Q387=\"OPERATIONAL\",\"W\",\"R\"))","v":"W"},{"$f":"Data!N387","v":"A "}]
[null,{"$f":"Data!K388","v":"LEEDS"},{"$f":"Data!D388","v":"GB3WP"},{"$f":"Data!F388","v":29.66},-0.10000000000000142,{"$f":"Data!G388","v":29.56},{"$f":"Data!L388","v":"NOR"},{"$f":"Data!M388","v":82.5},{"$f":"IF(Data!Q388=\"NOT OPERATIONAL\",\"X\",IF(Data!Q388=\"OPERATIONAL\",\"W\",\"R\"))","v":"W"},{"$f":"Data!N388","v":"A "}]
[null,{"$f":"Data!K389","v":"CHEDDAR"},{"$f":"Data!D389","v":"GB3WR"},{"$f":"Data!F389","v":145.6},-0.59999999999999432,{"$f":"Data!G389","v":145},{"$f":"Data!L389","v":"SW"},{"$f":"Data!M389","v":94.8},{"$f":"IF(Data!Q389=\"NOT OPERATIONAL\",\"X\",IF(Data!Q389=\"OPERATIONAL\",\"W\",\"R\"))","v":"X"},{"$f":"Data!N389","v":"A "}]
[null,{"$f":"Data!K390","v":"HORSHAM"},{"$f":"Data!D390","v":"GB3WS"},{"$f":"Data!F390","v":145.75},-0.59999999999999432,{"$f":"Data!G390","v":145.15},{"$f":"Data!L390","v":"SE"},{"$f":"Data!M390","v":88.5},{"$f":"IF(Data!Q390=\"NOT OPERATIONAL\",\"X\",IF(Data!Q390=\"OPERATIONAL\",\"W\",\"R\"))","v":"W"},{"$f":"Data!N390","v":"A "}]
[null,{"$f":"Data!K391","v":"OMAGH"},{"$f":"Data!D391","v":"GB3WT"},{"$f":"Data!F391","v":145.77500000000001},-0.59999999999999432,{"$f":"Data!G391","v":145.17500000000001},{"$f":"Data!L391","v":"NI"},{"$f":"Data!M391","v":110.9},{"$f":"IF(Data!Q391=\"NOT OPERATIONAL\",\"X\",IF(Data!Q391=\"OPERATIONAL\",\"W\",\"R\"))","v":"W"},{"$f":"Data!N391","v":"A "}]
[null,{"$f":"Data!K392","v":"WHITEHAVEN"},{"$f":"Data!D392","v":"GB3WU"},{"$f":"Data!F392","v":430.98750000000001},7.5999999999999659,{"$f":"Data!G392","v":438.58749999999998},{"$f":"Data!L392","v":"NOR"},{"$f":"Data!M392","v":77},{"$f":"IF(Data!Q392=\"NOT OPERATIONAL\",\"X\",IF(Data!Q392=\"OPERATIONAL\",\"W\",\"R\"))","v":"W"},{"$f":"Data!N392","v":"A DM FU "}]
[null,{"$f":"Data!K393","v":"PORT TALBOT"},{"$f":"Data!D393","v":"GB3WW"},{"$f":"Data!F393","v":145.77500000000001},{"$f":"F393-D393","v":-0.59999999999999432},{"$f":"Data!G393","v":145.17500000000001},{"$f":"Data!L393","v":"WM"},{"$f":"Data!M393","v":94.8},{"$f":"IF(Data!Q393=\"NOT OPERATIONAL\",\"X\",IF(Data!Q393=\"OPERATIONAL\",\"W\",\"R\"))","v":"R"},{"$f":"Data!N393","v":"A FU "}]
[null,{"$f":"Data!K394","v":"WYMONDHAM"},{"$f":"Data!D394","v":"GB3WX"},{"$f":"Data!F394","v":50.83},1,{"$f":"Data!G394","v":51.83},{"$f":"Data!L394","v":"EA"},{"$f":"Data!M394","v":94.8},{"$f":"IF(Data!Q394=\"NOT OPERATIONAL\",\"X\",IF(Data!Q394=\"OPERATIONAL\",\"W\",\"R\"))","v":"X"},{"$f":"Data!N394","v":"A "}]
[null,{"$f":"Data!K395","v":"WAKEFIELD"},{"$f":"Data!D395","v":"GB3WY"},{"$f":"Data!F395","v":50.8},0.5,{"$f":"Data!G395","v":51.3},{"$f":"Data!L395","v":"NOR"},{"$f":"Data!M395","v":82.5},{"$f":"IF(Data!Q395=\"NOT OPERATIONAL\",\"X\",IF(Data!Q395=\"OPERATIONAL\",\"W\",\"R\"))","v":"W"},{"$f":"Data!N395","v":"A "}]
[null,{"$f":"Data!K396","v":"DENTON"},{"$f":"Data!D396","v":"GB3XB"},{"$f":"Data!F396","v":144.5625},288.23750000000001,{"$f":"Data!G396","v":432.8},{"$f":"Data!L396","v":"NOR"},{"$f":"Data!M396","v":67},{"$f":"IF(Data!Q396=\"NOT OPERATIONAL\",\"X\",IF(Data!Q396=\"OPERATIONAL\",\"W\",\"R\"))","v":"X"},{"$f":"Data!N396","v":"FU "}]
[null,{"$f":"Data!K397","v":"LOUTH"},{"$f":"Data!D397","v":"GB3XD"},{"$f":"Data!F397","v":50.73},0.5,{"$f":"Data!G397","v":51.23},{"$f":"Data!L397","v":"MID"},{"$f":"Data!M397","v":71.900000000000006},{"$f":"IF(Data!Q397=\"NOT OPERATIONAL\",\"X\",IF(Data!Q397=\"OPERATIONAL\",\"W\",\"R\"))","v":"W"},{"$f":"Data!N397","v":"A "}]
[null,{"$f":"Data!K398","v":"SHIPLEY"},{"$f":"Data!D398","v":"GB3XL"},{"$f":"Data!F398","v":430.88749999999999},7.6000000000000227,{"$f":"Data!G398","v":438.48750000000001},{"$f":"Data!L398","v":"NOR"},{"$f":"Data!M398","v":82.5},{"$f":"IF(Data!Q398=\"NOT OPERATIONAL\",\"X\",IF(Data!Q398=\"OPERATIONAL\",\"W\",\"R\"))","v":"R"},{"$f":"Data!N398","v":"A DM "}]
[null,{"$f":"Data!K399","v":"WORKSOP"},{"$f":"Data!D399","v":"GB3XN"},{"$f":"Data!F399","v":430.92500000000001},7.5999999999999659,{"$f":"Data!G399","v":438.52499999999998},{"$f":"Data!L399","v":"MID"},{"$f":"Data!M399","v":71.900000000000006},{"$f":"IF(Data!Q399=\"NOT OPERATIONAL\",\"X\",IF(Data!Q399=\"OPERATIONAL\",\"W\",\"R\"))","v":"W"},{"$f":"Data!N399","v":"A "}]
[null,{"$f":"Data!K400","v":"MORDEN"},{"$f":"Data!D400","v":"GB3XP"},{"$f":"Data!F400","v":145.6875},-0.59999999999999432,{"$f":"Data!G400","v":145.08750000000001},{"$f":"Data!L400","v":"SE"},{"$f":"Data!M400","v":82.5},{"$f":"IF(Data!Q400=\"NOT OPERATIONAL\",\"X\",IF(Data!Q400=\"OPERATIONAL\",\"W\",\"R\"))","v":"R"},{"$f":"Data!N400","v":"A FU "}]
[null,{"$f":"Data!K401","v":"NORTHAMPTON"},{"$f":"Data!D401","v":"GB3XS"},{"$f":"Data!F401","v":50.85},0.5,{"$f":"Data!G401","v":51.35},{"$f":"Data!L401","v":"MID"},{"$f":"Data!M401","v":77},{"$f":"IF(Data!Q401=\"NOT OPERATIONAL\",\"X\",IF(Data!Q401=\"OPERATIONAL\",\"W\",\"R\"))","v":"R"},{"$f":"Data!N401","v":"A "}]
[null,{"$f":"Data!K402","v":"DAVENTRY"},{"$f":"Data!D402","v":"GB3XV"},{"$f":"Data!F402","v":430.25},9,{"$f":"Data!G402","v":439.25},{"$f":"Data!L402","v":"MID"},{"$f":"Data!M402","v":0},{"$f":"IF(Data!Q402=\"NOT OPERATIONAL\",\"X\",IF(Data!Q402=\"OPERATIONAL\",\"W\",\"R\"))","v":"W"},{"$f":"Data!N402","v":"FU "}]
[null,{"$f":"Data!K403","v":"DAVENTRY"},{"$f":"Data!D403","v":"GB3XX"},{"$f":"Data!F403","v":430.91250000000002},7.5999999999999659,{"$f":"Data!G403","v":438.51249999999999},{"$f":"Data!L403","v":"MID"},{"$f":"Data!M403","v":77},{"$f":"IF(Data!Q403=\"NOT OPERATIONAL\",\"X\",IF(Data!Q403=\"OPERATIONAL\",\"W\",\"R\"))","v":"W"},{"$f":"Data!N403","v":"A FU "}]
[null,{"$f":"Data!K404","v":"CWMBRAN"},{"$f":"Data!D404","v":"GB3YA"},{"$f":"Data!F404","v":145.71250000000001},-0.59999999999999432,{"$f":"Data!G404","v":145.11250000000001},{"$f":"Data!L404","v":"WM"},{"$f":"Data!M404","v":94.8},{"$f":"IF(Data!Q404=\"NOT OPERATIONAL\",\"X\",IF(Data!Q404=\"OPERATIONAL\",\"W\",\"R\"))","v":"W"},{"$f":"Data!N404","v":"A "}]
[null,{"$f":"Data!K405","v":"FILEY"},{"$f":"Data!D405","v":"GB3YC"},{"$f":"Data!F405","v":145.75},-0.59999999999999432,{"$f":"Data!G405","v":145.15},{"$f":"Data!L405","v":"NOR"},{"$f":"Data!M405","v":88.5},{"$f":"IF(Data!Q405=\"NOT OPERATIONAL\",\"X\",IF(Data!Q405=\"OPERATIONAL\",\"W\",\"R\"))","v":"R"},{"$f":"Data!N405","v":"A "}]
[null,{"$f":"Data!K406","v":"LLANGOLLEN"},{"$f":"Data!D406","v":"GB3YK"},{"$f":"Data!F406","v":145.58750000000001},-0.59999999999999432,{"$f":"Data!G406","v":144.98750000000001},{"$f":"Data!L406","v":"WM"},{"$f":"Data!M406","v":94.8},{"$f":"IF(Data!Q406=\"NOT OPERATIONAL\",\"X\",IF(Data!Q406=\"OPERATIONAL\",\"W\",\"R\"))","v":"X"},{"$f":"Data!N406","v":"A DM DS FU NX "}]
[null,{"$f":"Data!K407","v":"LOWESTOFT"},{"$f":"Data!D407","v":"GB3YL"},{"$f":"Data!F407","v":430.875},7.6000000000000227,{"$f":"Data!G407","v":438.47500000000002},{"$f":"Data!L407","v":"EA"},{"$f":"Data!M407","v":94.8},{"$f":"IF(Data!Q407=\"NOT OPERATIONAL\",\"X\",IF(Data!Q407=\"OPERATIONAL\",\"W\",\"R\"))","v":"W"},{"$f":"Data!N407","v":"A "}]
[null,{"$f":"Data!K408","v":"CLECKHEATON"},{"$f":"Data!D408","v":"GB3YN"},{"$f":"Data!F408","v":430.98750000000001},7.5999999999999659,{"$f":"Data!G408","v":438.58749999999998},{"$f":"Data!L408","v":"NOR"},{"$f":"Data!M408","v":0},{"$f":"IF(Data!Q408=\"NOT OPERATIONAL\",\"X\",IF(Data!Q408=\"OPERATIONAL\",\"W\",\"R\"))","v":"W"},{"$f":"Data!N408","v":"FU "}]
[null,{"$f":"Data!K409","v":"WAKEFIELD"},{"$f":"Data!D409","v":"GB3YW"},{"$f":"Data!F409","v":145.78749999999999},-0.59999999999999432,{"$f":"Data!G409","v":145.1875},{"$f":"Data!L409","v":"NOR"},{"$f":"Data!M409","v":82.5},{"$f":"IF(Data!Q409=\"NOT OPERATIONAL\",\"X\",IF(Data!Q409=\"OPERATIONAL\",\"W\",\"R\"))","v":"W"},{"$f":"Data!N409","v":"A "}]
[null,{"$f":"Data!K410","v":"HEREFORD"},{"$f":"Data!D410","v":"GB3ZA"},{"$f":"Data!F410","v":145.73750000000001},-0.60000000000002274,{"$f":"Data!G410","v":145.13749999999999},{"$f":"Data!L410","v":"MID"},{"$f":"Data!M410","v":118.8},{"$f":"IF(Data!Q410=\"NOT OPERATIONAL\",\"X\",IF(Data!Q410=\"OPERATIONAL\",\"W\",\"R\"))","v":"W"},{"$f":"Data!N410","v":"A FU "}]
[null,{"$f":"Data!K411","v":"BRISTOL"},{"$f":"Data!D411","v":"GB3ZB"},{"$f":"Data!F411","v":430.82499999999999},7.6000000000000227,{"$f":"Data!G411","v":438.42500000000001},{"$f":"Data!L411","v":"SW"},{"$f":"Data!M411","v":77},{"$f":"IF(Data!Q411=\"NOT OPERATIONAL\",\"X\",IF(Data!Q411=\"OPERATIONAL\",\"W\",\"R\"))","v":"W"},{"$f":"Data!N411","v":"A "}]
[null,{"$f":"Data!K412","v":"STAFFORD"},{"$f":"Data!D412","v":"GB3ZI"},{"$f":"Data!F412","v":430.97500000000002},7.5999999999999659,{"$f":"Data!G412","v":438.57499999999999},{"$f":"Data!L412","v":"MID"},{"$f":"Data!M412","v":103.5},{"$f":"IF(Data!Q412=\"NOT OPERATIONAL\",\"X\",IF(Data!Q412=\"OPERATIONAL\",\"W\",\"R\"))","v":"W"},{"$f":"Data!N412","v":"A FU "}]
[null,{"$f":"Data!K413","v":"HEBBURN"},{"$f":"Data!D413","v":"GB3ZN"},{"$f":"Data!F413","v":430.88749999999999},7.6000000000000227,{"$f":"Data!G413","v":438.48750000000001},{"$f":"Data!L413","v":"NOR"},{"$f":"Data!M413","v":118.8},{"$f":"IF(Data!Q413=\"NOT OPERATIONAL\",\"X\",IF(Data!Q413=\"OPERATIONAL\",\"W\",\"R\"))","v":"W"},{"$f":"Data!N413","v":"A "}]
[null,{"$f":"Data!K414","v":"NEWTOWN POWYS"},{"$f":"Data!D414","v":"GB3ZW"},{"$f":"Data!F414","v":50.81},0.5,{"$f":"Data!G414","v":51.31},{"$f":"Data!L414","v":"WM"},{"$f":"Data!M414","v":103.5},{"$f":"IF(Data!Q414=\"NOT OPERATIONAL\",\"X\",IF(Data!Q414=\"OPERATIONAL\",\"W\",\"R\"))","v":"W"},{"$f":"Data!N414","v":"A "}]
[null,{"$f":"Data!K415","v":"EASTBOURNE"},{"$f":"Data!D415","v":"GB3ZX"},{"$f":"Data!F415","v":430.82499999999999},7.6000000000000227,{"$f":"Data!G415","v":438.42500000000001},{"$f":"Data!L415","v":"SE"},{"$f":"Data!M415","v":88.5},{"$f":"IF(Data!Q415=\"NOT OPERATIONAL\",\"X\",IF(Data!Q415=\"OPERATIONAL\",\"W\",\"R\"))","v":"W"},{"$f":"Data!N415","v":"A "}]
[null,{"$f":"Data!K416","v":"BRISTOL"},{"$f":"Data!D416","v":"GB3ZY"},{"$f":"Data!F416","v":50.8},0.5,{"$f":"Data!G416","v":51.3},{"$f":"Data!L416","v":"SW"},{"$f":"Data!M416","v":77},{"$f":"IF(Data!Q416=\"NOT OPERATIONAL\",\"X\",IF(Data!Q416=\"OPERATIONAL\",\"W\",\"R\"))","v":"W"},{"$f":"Data!N416","v":"A "}]
[null,{"$f":"Data!K417","v":"BRISTOL"},{"$f":"Data!D417","v":"GB7AA"},{"$f":"Data!F417","v":439.67500000000001},-9,{"$f":"Data!G417","v":430.67500000000001},{"$f":"Data!L417","v":"SW"},{"$f":"Data!M417","v":0},{"$f":"IF(Data!Q417=\"NOT OPERATIONAL\",\"X\",IF(Data!Q417=\"OPERATIONAL\",\"W\",\"R\"))","v":"W"},{"$f":"Data!N417","v":"DM "}]
[null,{"$f":"Data!K418","v":"ABERDEEN"},{"$f":"Data!D418","v":"GB7AB"},{"$f":"Data!F418","v":439.66250000000002},-9,{"$f":"Data!G418","v":430.66250000000002},{"$f":"Data!L418","v":"SCO"},{"$f":"Data!M418","v":0},{"$f":"IF(Data!Q418=\"NOT OPERATIONAL\",\"X\",IF(Data!Q418=\"OPERATIONAL\",\"W\",\"R\"))","v":"W"},{"$f":"Data!N418","v":"FU "}]
[null,{"$f":"Data!K419","v":"LARGS"},{"$f":"Data!D419","v":"GB7AC"},{"$f":"Data!F419","v":430.95},7.6000000000000227,{"$f":"Data!G419","v":438.55},{"$f":"Data!L419","v":"SCO"},{"$f":"Data!M419","v":103.5},{"$f":"IF(Data!Q419=\"NOT OPERATIONAL\",\"X\",IF(Data!Q419=\"OPERATIONAL\",\"W\",\"R\"))","v":"W"},{"$f":"Data!N419","v":"A DM "}]
[null,{"$f":"Data!K420","v":"BRISTOL"},{"$f":"Data!D420","v":"GB7AD"},{"$f":"Data!F420","v":439.76249999999999},-9,{"$f":"Data!G420","v":430.76249999999999},{"$f":"Data!L420","v":"SW"},{"$f":"Data!M420","v":0},{"$f":"IF(Data!Q420=\"NOT OPERATIONAL\",\"X\",IF(Data!Q420=\"OPERATIONAL\",\"W\",\"R\"))","v":"W"},{"$f":"Data!N420","v":"DS "}]
[null,{"$f":"Data!K421","v":"HUCKNALL"},{"$f":"Data!D421","v":"GB7AF"},{"$f":"Data!F421","v":430.88749999999999},7.6000000000000227,{"$f":"Data!G421","v":438.48750000000001},{"$f":"Data!L421","v":"MID"},{"$f":"Data!M421","v":71.900000000000006},{"$f":"IF(Data!Q421=\"NOT OPERATIONAL\",\"X\",IF(Data!Q421=\"OPERATIONAL\",\"W\",\"R\"))","v":"W"},{"$f":"Data!N421","v":"A DM DS FU NX "}]
[null,{"$f":"Data!K422","v":"FORFAR"},{"$f":"Data!D422","v":"GB7AG"},{"$f":"Data!F422","v":430.9},7.6000000000000227,{"$f":"Data!G422","v":438.5},{"$f":"Data!L422","v":"SCO"},{"$f":"Data!M422","v":94.8},{"$f":"IF(Data!Q422=\"NOT OPERATIONAL\",\"X\",IF(Data!Q422=\"OPERATIONAL\",\"W\",\"R\"))","v":"W"},{"$f":"Data!N422","v":"A DM DS FU "}]
[null,{"$f":"Data!K423","v":"HAWICK"},{"$f":"Data!D423","v":"GB7AI"},{"$f":"Data!F423","v":439.33749999999998},-9,{"$f":"Data!G423","v":430.33749999999998},{"$f":"Data!L423","v":"SCO"},{"$f":"Data!M423","v":103.5},{"$f":"IF(Data!Q423=\"NOT OPERATIONAL\",\"X\",IF(Data!Q423=\"OPERATIONAL\",\"W\",\"R\"))","v":"W"},{"$f":"Data!N423","v":"A DM "}]
[null,{"$f":"Data!K424","v":"IPSWICH"},{"$f":"Data!D424","v":"GB7AL"},{"$f":"Data!F424","v":439.4},-9,{"$f":"Data!G424","v":430.4},{"$f":"Data!L424","v":"EA"},{"$f":"Data!M424","v":0},{"$f":"IF(Data!Q424=\"NOT OPERATIONAL\",\"X\",IF(Data!Q424=\"OPERATIONAL\",\"W\",\"R\"))","v":"W"},{"$f":"Data!N424","v":"DM "}]
[null,{"$f":"Data!K425","v":"ACCRINGTON"},{"$f":"Data!D425","v":"GB7AN"},{"$f":"Data!F425","v":439.46249999999998},-9,{"$f":"Data!G425","v":430.46249999999998},{"$f":"Data!L425","v":"NOR"},{"$f":"Data!M425","v":0},{"$f":"IF(Data!Q425=\"NOT OPERATIONAL\",\"X\",IF(Data!Q425=\"OPERATIONAL\",\"W\",\"R\"))","v":"W"},{"$f":"Data!N425","v":"FU "}]
[null,{"$f":"Data!K426","v":"NEW ASH GREEN"},{"$f":"Data!D426","v":"GB7AR"},{"$f":"Data!F426","v":439.52499999999998},-9,{"$f":"Data!G426","v":430.52499999999998},{"$f":"Data!L426","v":"SE"},{"$f":"Data!M426","v":0},{"$f":"IF(Data!Q426=\"NOT OPERATIONAL\",\"X\",IF(Data!Q426=\"OPERATIONAL\",\"W\",\"R\"))","v":"W"},{"$f":"Data!N426","v":"DM DS FU NX "}]
[null,{"$f":"Data!K427","v":"ASHFORD"},{"$f":"Data!D427","v":"GB7AS"},{"$f":"Data!F427","v":439.42500000000001},-9,{"$f":"Data!G427","v":430.42500000000001},{"$f":"Data!L427","v":"SE"},{"$f":"Data!M427","v":0},{"$f":"IF(Data!Q427=\"NOT OPERATIONAL\",\"X\",IF(Data!Q427=\"OPERATIONAL\",\"W\",\"R\"))","v":"W"},{"$f":"Data!N427","v":"DM "}]
[null,{"$f":"Data!K428","v":"AMERSHAM"},{"$f":"Data!D428","v":"GB7AU"},{"$f":"Data!F428","v":439.7},-9,{"$f":"Data!G428","v":430.7},{"$f":"Data!L428","v":"SE"},{"$f":"Data!M428","v":0},{"$f":"IF(Data!Q428=\"NOT OPERATIONAL\",\"X\",IF(Data!Q428=\"OPERATIONAL\",\"W\",\"R\"))","v":"W"},{"$f":"Data!N428","v":"DS FU "}]
[null,{"$f":"Data!K429","v":"AYLESBURY"},{"$f":"Data!D429","v":"GB7AV"},{"$f":"Data!F429","v":439.4375},-9,{"$f":"Data!G429","v":430.4375},{"$f":"Data!L429","v":"SE"},{"$f":"Data!M429","v":0},{"$f":"IF(Data!Q429=\"NOT OPERATIONAL\",\"X\",IF(Data!Q429=\"OPERATIONAL\",\"W\",\"R\"))","v":"W"},{"$f":"Data!N429","v":"DM "}]
[null,{"$f":"Data!K430","v":"KILMARNOCK"},{"$f":"Data!D430","v":"GB7AY"},{"$f":"Data!F430","v":430.8125},7.6000000000000227,{"$f":"Data!G430","v":438.41250000000002},{"$f":"Data!L430","v":"SCO"},{"$f":"Data!M430","v":0},{"$f":"IF(Data!Q430=\"NOT OPERATIONAL\",\"X\",IF(Data!Q430=\"OPERATIONAL\",\"W\",\"R\"))","v":"W"},{"$f":"Data!N430","v":"A FU "}]
[null,{"$f":"Data!K431","v":"BRADFORD"},{"$f":"Data!D431","v":"GB7BA"},{"$f":"Data!F431","v":439.76249999999999},-9,{"$f":"Data!G431","v":430.76249999999999},{"$f":"Data!L431","v":"NOR"},{"$f":"Data!M431","v":0},{"$f":"IF(Data!Q431=\"NOT OPERATIONAL\",\"X\",IF(Data!Q431=\"OPERATIONAL\",\"W\",\"R\"))","v":"W"},{"$f":"Data!N431","v":"DM "}]
[null,{"$f":"Data!K432","v":"BANFF"},{"$f":"Data!D432","v":"GB7BB"},{"$f":"Data!F432","v":439.71249999999998},-9,{"$f":"Data!G432","v":430.71249999999998},{"$f":"Data!L432","v":"SCO"},{"$f":"Data!M432","v":0},{"$f":"IF(Data!Q432=\"NOT OPERATIONAL\",\"X\",IF(Data!Q432=\"OPERATIONAL\",\"W\",\"R\"))","v":"W"},{"$f":"Data!N432","v":"DM "}]
[null,{"$f":"Data!K433","v":"BRIGHTON"},{"$f":"Data!D433","v":"GB7BC"},{"$f":"Data!F433","v":439.65},-9,{"$f":"Data!G433","v":430.65},{"$f":"Data!L433","v":"SE"},{"$f":"Data!M433","v":0},{"$f":"IF(Data!Q433=\"NOT OPERATIONAL\",\"X\",IF(Data!Q433=\"OPERATIONAL\",\"W\",\"R\"))","v":"W"},{"$f":"Data!N433","v":"DM DS FU NX "}]
[null,{"$f":"Data!K434","v":"BRISTOL"},{"$f":"Data!D434","v":"GB7BD"},{"$f":"Data!F434","v":430.95},7.6000000000000227,{"$f":"Data!G434","v":438.55},{"$f":"Data!L434","v":"SW"},{"$f":"Data!M434","v":0},{"$f":"IF(Data!Q434=\"NOT OPERATIONAL\",\"X\",IF(Data!Q434=\"OPERATIONAL\",\"W\",\"R\"))","v":"W"},{"$f":"Data!N434","v":"DM "}]
[null,{"$f":"Data!K435","v":"BECCLES"},{"$f":"Data!D435","v":"GB7BE"},{"$f":"Data!F435","v":439.66250000000002},-9,{"$f":"Data!G435","v":430.66250000000002},{"$f":"Data!L435","v":"EA"},{"$f":"Data!M435","v":0},{"$f":"IF(Data!Q435=\"NOT OPERATIONAL\",\"X\",IF(Data!Q435=\"OPERATIONAL\",\"W\",\"R\"))","v":"W"},{"$f":"Data!N435","v":"DS FU NX "}]
[null,{"$f":"Data!K436","v":"BLACKPOOL"},{"$f":"Data!D436","v":"GB7BF"},{"$f":"Data!F436","v":430.3},9,{"$f":"Data!G436","v":439.3},{"$f":"Data!L436","v":"NOR"},{"$f":"Data!M436","v":0},{"$f":"IF(Data!Q436=\"NOT OPERATIONAL\",\"X\",IF(Data!Q436=\"OPERATIONAL\",\"W\",\"R\"))","v":"W"},{"$f":"Data!N436","v":"DM DS FU "}]
[null,{"$f":"Data!K437","v":"BRIGHTON"},{"$f":"Data!D437","v":"GB7BH"},{"$f":"Data!F437","v":439.57499999999999},-9,{"$f":"Data!G437","v":430.57499999999999},{"$f":"Data!L437","v":"SE"},{"$f":"Data!M437","v":0},{"$f":"IF(Data!Q437=\"NOT OPERATIONAL\",\"X\",IF(Data!Q437=\"OPERATIONAL\",\"W\",\"R\"))","v":"R"},{"$f":"Data!N437","v":"DM DS FU "}]
[null,{"$f":"Data!K438","v":"MUIR OF ORD"},{"$f":"Data!D438","v":"GB7BI"},{"$f":"Data!F438","v":430.82499999999999},7.6000000000000227,{"$f":"Data!G438","v":438.42500000000001},{"$f":"Data!L438","v":"SCO"},{"$f":"Data!M438","v":0},{"$f":"IF(Data!Q438=\"NOT OPERATIONAL\",\"X\",IF(Data!Q438=\"OPERATIONAL\",\"W\",\"R\"))","v":"X"},{"$f":"Data!N438","v":"DM "}]
[null,{"$f":"Data!K439","v":"MALVERN"},{"$f":"Data!D439","v":"GB7BJ"},{"$f":"Data!F439","v":439.73750000000001},-9,{"$f":"Data!G439","v":430.73750000000001},{"$f":"Data!L439","v":"MID"},{"$f":"Data!M439","v":0},{"$f":"IF(Data!Q439=\"NOT OPERATIONAL\",\"X\",IF(Data!Q439=\"OPERATIONAL\",\"W\",\"R\"))","v":"W"},{"$f":"Data!N439","v":"DM "}]
[null,{"$f":"Data!K440","v":"READING"},{"$f":"Data!D440","v":"GB7BK"},{"$f":"Data!F440","v":439.73750000000001},-9,{"$f":"Data!G440","v":430.73750000000001},{"$f":"Data!L440","v":"SW"},{"$f":"Data!M440","v":0},{"$f":"IF(Data!Q440=\"NOT OPERATIONAL\",\"X\",IF(Data!Q440=\"OPERATIONAL\",\"W\",\"R\"))","v":"W"},{"$f":"Data!N440","v":"DM "}]
[null,{"$f":"Data!K441","v":"ALLENDALE"},{"$f":"Data!D441","v":"GB7BL"},{"$f":"Data!F441","v":439.67500000000001},-9,{"$f":"Data!G441","v":430.67500000000001},{"$f":"Data!L441","v":"NOR"},{"$f":"Data!M441","v":118.8},{"$f":"IF(Data!Q441=\"NOT OPERATIONAL\",\"X\",IF(Data!Q441=\"OPERATIONAL\",\"W\",\"R\"))","v":"W"},{"$f":"Data!N441","v":"A DM DS FU NX "}]
[null,{"$f":"Data!K442","v":"BIRMINGHAM"},{"$f":"Data!D442","v":"GB7BM-B"},{"$f":"Data!F442","v":439.4},-9,{"$f":"Data!G442","v":430.4},{"$f":"Data!L442","v":"MID"},{"$f":"Data!M442","v":0},{"$f":"IF(Data!Q442=\"NOT OPERATIONAL\",\"X\",IF(Data!Q442=\"OPERATIONAL\",\"W\",\"R\"))","v":"W"},{"$f":"Data!N442","v":"DM "}]
[null,{"$f":"Data!K443","v":"BIRMINGHAM"},{"$f":"Data!D443","v":"GB7BM-C"},{"$f":"Data!F443","v":145.73750000000001},-0.60000000000002274,{"$f":"Data!G443","v":145.13749999999999},{"$f":"Data!L443","v":"MID"},{"$f":"Data!M443","v":67},{"$f":"IF(Data!Q443=\"NOT OPERATIONAL\",\"X\",IF(Data!Q443=\"OPERATIONAL\",\"W\",\"R\"))","v":"W"},{"$f":"Data!N443","v":"A DM "}]
[null,{"$f":"Data!K444","v":"MILTON KEYNES"},{"$f":"Data!D444","v":"GB7BP"},{"$f":"Data!F444","v":439.45},-9,{"$f":"Data!G444","v":430.45},{"$f":"Data!L444","v":"SE"},{"$f":"Data!M444","v":0},{"$f":"IF(Data!Q444=\"NOT OPERATIONAL\",\"X\",IF(Data!Q444=\"OPERATIONAL\",\"W\",\"R\"))","v":"W"},{"$f":"Data!N444","v":"DS "}]
[null,{"$f":"Data!K445","v":"RAMSEY IOM"},{"$f":"Data!D445","v":"GB7BR"},{"$f":"Data!F445","v":430.92500000000001},7.5999999999999659,{"$f":"Data!G445","v":438.52499999999998},{"$f":"Data!L445","v":"NOR"},{"$f":"Data!M445","v":0},{"$f":"IF(Data!Q445=\"NOT OPERATIONAL\",\"X\",IF(Data!Q445=\"OPERATIONAL\",\"W\",\"R\"))","v":"W"},{"$f":"Data!N445","v":"DM "}]
[null,{"$f":"Data!K446","v":"BRISTOL"},{"$f":"Data!D446","v":"GB7BS"},{"$f":"Data!F446","v":439.16250000000002},-9,{"$f":"Data!G446","v":430.16250000000002},{"$f":"Data!L446","v":"SW"},{"$f":"Data!M446","v":0},{"$f":"IF(Data!Q446=\"NOT OPERATIONAL\",\"X\",IF(Data!Q446=\"OPERATIONAL\",\"W\",\"R\"))","v":"W"},{"$f":"Data!N446","v":"DM "}]
[null,{"$f":"Data!K447","v":"BRISTOL"},{"$f":"Data!D447","v":"GB7BT"},{"$f":"Data!F447","v":439.63749999999999},-9,{"$f":"Data!G447","v":430.63749999999999},{"$f":"Data!L447","v":"SW"},{"$f":"Data!M447","v":0},{"$f":"IF(Data!Q447=\"NOT OPERATIONAL\",\"X\",IF(Data!Q447=\"OPERATIONAL\",\"W\",\"R\"))","v":"W"},{"$f":"Data!N447","v":"DM DS FU "}]
[null,{"$f":"Data!K448","v":"WAKEFIELD "},{"$f":"Data!D448","v":"GB7BW"},{"$f":"Data!F448","v":439.72500000000002},-9,{"$f":"Data!G448","v":430.72500000000002},{"$f":"Data!L448","v":"NOR"},{"$f":"Data!M448","v":0},{"$f":"IF(Data!Q448=\"NOT OPERATIONAL\",\"X\",IF(Data!Q448=\"OPERATIONAL\",\"W\",\"R\"))","v":"W"},{"$f":"Data!N448","v":"DM DS FU "}]
[null,{"$f":"Data!K449","v":"CLEOBURY NORTH"},{"$f":"Data!D449","v":"GB7BX"},{"$f":"Data!F449","v":439.4375},-9,{"$f":"Data!G449","v":430.4375},{"$f":"Data!L449","v":"MID"},{"$f":"Data!M449","v":0},{"$f":"IF(Data!Q449=\"NOT OPERATIONAL\",\"X\",IF(Data!Q449=\"OPERATIONAL\",\"W\",\"R\"))","v":"W"},{"$f":"Data!N449","v":"DM "}]
[null,{"$f":"Data!K450","v":"BOZEAT"},{"$f":"Data!D450","v":"GB7BZ"},{"$f":"Data!F450","v":439.41250000000002},-9,{"$f":"Data!G450","v":430.41250000000002},{"$f":"Data!L450","v":"MID"},{"$f":"Data!M450","v":0},{"$f":"IF(Data!Q450=\"NOT OPERATIONAL\",\"X\",IF(Data!Q450=\"OPERATIONAL\",\"W\",\"R\"))","v":"W"},{"$f":"Data!N450","v":"DS "}]
[null,{"$f":"Data!K451","v":"DOUGLAS"},{"$f":"Data!D451","v":"GB7CA"},{"$f":"Data!F451","v":430.92500000000001},7.5999999999999659,{"$f":"Data!G451","v":438.52499999999998},{"$f":"Data!L451","v":"NOR"},{"$f":"Data!M451","v":0},{"$f":"IF(Data!Q451=\"NOT OPERATIONAL\",\"X\",IF(Data!Q451=\"OPERATIONAL\",\"W\",\"R\"))","v":"W"},{"$f":"Data!N451","v":"DM "}]
[null,{"$f":"Data!K452","v":"BATHGATE"},{"$f":"Data!D452","v":"GB7CB"},{"$f":"Data!F452","v":439.71249999999998},-9,{"$f":"Data!G452","v":430.71249999999998},{"$f":"Data!L452","v":"SCO"},{"$f":"Data!M452","v":0},{"$f":"IF(Data!Q452=\"NOT OPERATIONAL\",\"X\",IF(Data!Q452=\"OPERATIONAL\",\"W\",\"R\"))","v":"W"},{"$f":"Data!N452","v":"DM NX "}]
[null,{"$f":"Data!K453","v":"CHELTENHAM"},{"$f":"Data!D453","v":"GB7CC"},{"$f":"Data!F453","v":430.98750000000001},7.5999999999999659,{"$f":"Data!G453","v":438.58749999999998},{"$f":"Data!L453","v":"SW"},{"$f":"Data!M453","v":94.8},{"$f":"IF(Data!Q453=\"NOT OPERATIONAL\",\"X\",IF(Data!Q453=\"OPERATIONAL\",\"W\",\"R\"))","v":"W"},{"$f":"Data!N453","v":"A "}]
[null,{"$f":"Data!K454","v":"CARDIFF"},{"$f":"Data!D454","v":"GB7CD"},{"$f":"Data!F454","v":439.7},-9,{"$f":"Data!G454","v":430.7},{"$f":"Data!L454","v":"WM"},{"$f":"Data!M454","v":0},{"$f":"IF(Data!Q454=\"NOT OPERATIONAL\",\"X\",IF(Data!Q454=\"OPERATIONAL\",\"W\",\"R\"))","v":"W"},{"$f":"Data!N454","v":"DS "}]
[null,{"$f":"Data!K455","v":"GREAT CLACTON"},{"$f":"Data!D455","v":"GB7CE"},{"$f":"Data!F455","v":439.61250000000001},-9,{"$f":"Data!G455","v":430.61250000000001},{"$f":"Data!L455","v":"EA"},{"$f":"Data!M455","v":0},{"$f":"IF(Data!Q455=\"NOT OPERATIONAL\",\"X\",IF(Data!Q455=\"OPERATIONAL\",\"W\",\"R\"))","v":"W"},{"$f":"Data!N455","v":"FU "}]
[null,{"$f":"Data!K456","v":"CLANFIELD"},{"$f":"Data!D456","v":"GB7CF"},{"$f":"Data!F456","v":439.625},-9,{"$f":"Data!G456","v":430.625},{"$f":"Data!L456","v":"SW"},{"$f":"Data!M456","v":0},{"$f":"IF(Data!Q456=\"NOT OPERATIONAL\",\"X\",IF(Data!Q456=\"OPERATIONAL\",\"W\",\"R\"))","v":"W"},{"$f":"Data!N456","v":"DM "}]
[null,{"$f":"Data!K457","v":"WOBURN SANDS"},{"$f":"Data!D457","v":"GB7CG"},{"$f":"Data!F457","v":145.71250000000001},{"$f":"F457-D457","v":-0.59999999999999432},{"$f":"Data!G457","v":145.11250000000001},{"$f":"Data!L457","v":"SE"},{"$f":"Data!M457","v":77},{"$f":"IF(Data!Q457=\"NOT OPERATIONAL\",\"X\",IF(Data!Q457=\"OPERATIONAL\",\"W\",\"R\"))","v":"W"},{"$f":"Data!N457","v":"A FU "}]
[null,{"$f":"Data!K458","v":"KIRRIEMUIR"},{"$f":"Data!D458","v":"GB7CH"},{"$f":"Data!F458","v":430.82499999999999},7.6000000000000227,{"$f":"Data!G458","v":438.42500000000001},{"$f":"Data!L458","v":"SCO"},{"$f":"Data!M458","v":94.8},{"$f":"IF(Data!Q458=\"NOT OPERATIONAL\",\"X\",IF(Data!Q458=\"OPERATIONAL\",\"W\",\"R\"))","v":"X"},{"$f":"Data!N458","v":"A DM FU "}]
[null,{"$f":"Data!K459","v":"FOLKESTONE"},{"$f":"Data!D459","v":"GB7CK"},{"$f":"Data!F459","v":439.73750000000001},-9,{"$f":"Data!G459","v":430.73750000000001},{"$f":"Data!L459","v":"SE"},{"$f":"Data!M459","v":0},{"$f":"IF(Data!Q459=\"NOT OPERATIONAL\",\"X\",IF(Data!Q459=\"OPERATIONAL\",\"W\",\"R\"))","v":"W"},{"$f":"Data!N459","v":"DM "}]
[null,{"$f":"Data!K460","v":"CLACTON ON SEA"},{"$f":"Data!D460","v":"GB7CL"},{"$f":"Data!F460","v":439.63749999999999},-9,{"$f":"Data!G460","v":430.63749999999999},{"$f":"Data!L460","v":"EA"},{"$f":"Data!M460","v":0},{"$f":"IF(Data!Q460=\"NOT OPERATIONAL\",\"X\",IF(Data!Q460=\"OPERATIONAL\",\"W\",\"R\"))","v":"W"},{"$f":"Data!N460","v":"DM "}]
[null,{"$f":"Data!K461","v":"MILTON ABBAS"},{"$f":"Data!D461","v":"GB7CM"},{"$f":"Data!F461","v":145.69999999999999},-0.59999999999999432,{"$f":"Data!G461","v":145.1},{"$f":"Data!L461","v":"SW"},{"$f":"Data!M461","v":71.900000000000006},{"$f":"IF(Data!Q461=\"NOT OPERATIONAL\",\"X\",IF(Data!Q461=\"OPERATIONAL\",\"W\",\"R\"))","v":"W"},{"$f":"Data!N461","v":"A FU "}]
[null,{"$f":"Data!K462","v":"CANNOCK"},{"$f":"Data!D462","v":"GB7CN"},{"$f":"Data!F462","v":430.97500000000002},7.5999999999999659,{"$f":"Data!G462","v":438.57499999999999},{"$f":"Data!L462","v":"MID"},{"$f":"Data!M462","v":67},{"$f":"IF(Data!Q462=\"NOT OPERATIONAL\",\"X\",IF(Data!Q462=\"OPERATIONAL\",\"W\",\"R\"))","v":"R"},{"$f":"Data!N462","v":"A DM "}]
[null,{"$f":"Data!K463","v":"FAREHAM"},{"$f":"Data!D463","v":"GB7CO"},{"$f":"Data!F463","v":439.48750000000001},-9,{"$f":"Data!G463","v":430.48750000000001},{"$f":"Data!L463","v":"SW"},{"$f":"Data!M463","v":0},{"$f":"IF(Data!Q463=\"NOT OPERATIONAL\",\"X\",IF(Data!Q463=\"OPERATIONAL\",\"W\",\"R\"))","v":"W"},{"$f":"Data!N463","v":"DM DS FU NX "}]
[null,{"$f":"Data!K464","v":"SLOUGH"},{"$f":"Data!D464","v":"GB7CP"},{"$f":"Data!F464","v":430.82499999999999},7.6000000000000227,{"$f":"Data!G464","v":438.42500000000001},{"$f":"Data!L464","v":"SW"},{"$f":"Data!M464","v":77},{"$f":"IF(Data!Q464=\"NOT OPERATIONAL\",\"X\",IF(Data!Q464=\"OPERATIONAL\",\"W\",\"R\"))","v":"W"},{"$f":"Data!N464","v":"A FU "}]
[null,{"$f":"Data!K465","v":"WORTHING"},{"$f":"Data!D465","v":"GB7CQ"},{"$f":"Data!F465","v":439.61250000000001},-9,{"$f":"Data!G465","v":430.61250000000001},{"$f":"Data!L465","v":"SE"},{"$f":"Data!M465","v":0},{"$f":"IF(Data!Q465=\"NOT OPERATIONAL\",\"X\",IF(Data!Q465=\"OPERATIONAL\",\"W\",\"R\"))","v":"W"},{"$f":"Data!N465","v":"DM DS FU "}]
[null,{"$f":"Data!K466","v":"GLASGOW"},{"$f":"Data!D466","v":"GB7CS"},{"$f":"Data!F466","v":439.77499999999998},-9,{"$f":"Data!G466","v":430.77499999999998},{"$f":"Data!L466","v":"SCO"},{"$f":"Data!M466","v":0},{"$f":"IF(Data!Q466=\"NOT OPERATIONAL\",\"X\",IF(Data!Q466=\"OPERATIONAL\",\"W\",\"R\"))","v":"W"},{"$f":"Data!N466","v":"FU "}]
[null,{"$f":"Data!K467","v":"TRING"},{"$f":"Data!D467","v":"GB7CT"},{"$f":"Data!F467","v":145.63749999999999},-0.59999999999999432,{"$f":"Data!G467","v":145.03749999999999},{"$f":"Data!L467","v":"SE"},{"$f":"Data!M467","v":0},{"$f":"IF(Data!Q467=\"NOT OPERATIONAL\",\"X\",IF(Data!Q467=\"OPERATIONAL\",\"W\",\"R\"))","v":"W"},{"$f":"Data!N467","v":"DM "}]
[null,{"$f":"Data!K468","v":"MARYPORT"},{"$f":"Data!D468","v":"GB7CU"},{"$f":"Data!F468","v":439.76249999999999},-9,{"$f":"Data!G468","v":430.76249999999999},{"$f":"Data!L468","v":"NOR"},{"$f":"Data!M468","v":0},{"$f":"IF(Data!Q468=\"NOT OPERATIONAL\",\"X\",IF(Data!Q468=\"OPERATIONAL\",\"W\",\"R\"))","v":"W"},{"$f":"Data!N468","v":"DM DS FU "}]
[null,{"$f":"Data!K469","v":"WINCHESTER"},{"$f":"Data!D469","v":"GB7CW"},{"$f":"Data!F469","v":439.6},-9,{"$f":"Data!G469","v":430.6},{"$f":"Data!L469","v":"SW"},{"$f":"Data!M469","v":0},{"$f":"IF(Data!Q469=\"NOT OPERATIONAL\",\"X\",IF(Data!Q469=\"OPERATIONAL\",\"W\",\"R\"))","v":"W"},{"$f":"Data!N469","v":"DM "}]
[null,{"$f":"Data!K470","v":"COLERAINE"},{"$f":"Data!D470","v":"GB7CX"},{"$f":"Data!F470","v":430.86250000000001},7.5999999999999659,{"$f":"Data!G470","v":438.46249999999998},{"$f":"Data!L470","v":"NI"},{"$f":"Data!M470","v":0},{"$f":"IF(Data!Q470=\"NOT OPERATIONAL\",\"X\",IF(Data!Q470=\"OPERATIONAL\",\"W\",\"R\"))","v":"W"},{"$f":"Data!N470","v":"DM DS FU "}]
[null,{"$f":"Data!K471","v":"CROOK"},{"$f":"Data!D471","v":"GB7CY"},{"$f":"Data!F471","v":439.625},-9,{"$f":"Data!G471","v":430.625},{"$f":"Data!L471","v":"NOR"},{"$f":"Data!M471","v":0},{"$f":"IF(Data!Q471=\"NOT OPERATIONAL\",\"X\",IF(Data!Q471=\"OPERATIONAL\",\"W\",\"R\"))","v":"W"},{"$f":"Data!N471","v":"FU "}]
[null,{"$f":"Data!K472","v":"CROOK"},{"$f":"Data!D472","v":"GB7CZ"},{"$f":"Data!F472","v":439.5},-9,{"$f":"Data!G472","v":430.5},{"$f":"Data!L472","v":"NOR"},{"$f":"Data!M472","v":118.8},{"$f":"IF(Data!Q472=\"NOT OPERATIONAL\",\"X\",IF(Data!Q472=\"OPERATIONAL\",\"W\",\"R\"))","v":"W"},{"$f":"Data!N472","v":"A DM DS FU NX "}]
[null,{"$f":"Data!K473","v":"AIRDRIE"},{"$f":"Data!D473","v":"GB7DA"},{"$f":"Data!F473","v":145.77500000000001},-0.59999999999999432,{"$f":"Data!G473","v":145.17500000000001},{"$f":"Data!L473","v":"SCO"},{"$f":"Data!M473","v":0},{"$f":"IF(Data!Q473=\"NOT OPERATIONAL\",\"X\",IF(Data!Q473=\"OPERATIONAL\",\"W\",\"R\"))","v":"W"},{"$f":"Data!N473","v":"DM DS FU "}]
[null,{"$f":"Data!K474","v":"DUNBAR"},{"$f":"Data!D474","v":"GB7DB"},{"$f":"Data!F474","v":145.75},-0.59999999999999432,{"$f":"Data!G474","v":145.15},{"$f":"Data!L474","v":"SCO"},{"$f":"Data!M474","v":0},{"$f":"IF(Data!Q474=\"NOT OPERATIONAL\",\"X\",IF(Data!Q474=\"OPERATIONAL\",\"W\",\"R\"))","v":"X"},{"$f":"Data!N474","v":"DM "}]
[null,{"$f":"Data!K475","v":"DERBY"},{"$f":"Data!D475","v":"GB7DC"},{"$f":"Data!F475","v":439.35},-9,{"$f":"Data!G475","v":430.35},{"$f":"Data!L475","v":"MID"},{"$f":"Data!M475","v":71.900000000000006},{"$f":"IF(Data!Q475=\"NOT OPERATIONAL\",\"X\",IF(Data!Q475=\"OPERATIONAL\",\"W\",\"R\"))","v":"W"},{"$f":"Data!N475","v":"A DM DS FU NX "}]
[null,{"$f":"Data!K476","v":"DUNDEE"},{"$f":"Data!D476","v":"GB7DD"},{"$f":"Data!F476","v":439.66250000000002},-9,{"$f":"Data!G476","v":430.66250000000002},{"$f":"Data!L476","v":"SCO"},{"$f":"Data!M476","v":0},{"$f":"IF(Data!Q476=\"NOT OPERATIONAL\",\"X\",IF(Data!Q476=\"OPERATIONAL\",\"W\",\"R\"))","v":"W"},{"$f":"Data!N476","v":"DM NX "}]
[null,{"$f":"Data!K477","v":"KENNOWAY  FIFE"},{"$f":"Data!D477","v":"GB7DE"},{"$f":"Data!F477","v":145.63749999999999},-0.59999999999999432,{"$f":"Data!G477","v":145.03749999999999},{"$f":"Data!L477","v":"SCO"},{"$f":"Data!M477","v":94.8},{"$f":"IF(Data!Q477=\"NOT OPERATIONAL\",\"X\",IF(Data!Q477=\"OPERATIONAL\",\"W\",\"R\"))","v":"W"},{"$f":"Data!N477","v":"A DM "}]
[null,{"$f":"Data!K478","v":"PORTPATRICK"},{"$f":"Data!D478","v":"GB7DG"},{"$f":"Data!F478","v":430.9},7.6000000000000227,{"$f":"Data!G478","v":438.5},{"$f":"Data!L478","v":"SCO"},{"$f":"Data!M478","v":0},{"$f":"IF(Data!Q478=\"NOT OPERATIONAL\",\"X\",IF(Data!Q478=\"OPERATIONAL\",\"W\",\"R\"))","v":"W"},{"$f":"Data!N478","v":"A DM "}]
[null,{"$f":"Data!K479","v":"NORTHWICH"},{"$f":"Data!D479","v":"GB7DH"},{"$f":"Data!F479","v":439.58749999999998},-9,{"$f":"Data!G479","v":430.58749999999998},{"$f":"Data!L479","v":"NOR"},{"$f":"Data!M479","v":0},{"$f":"IF(Data!Q479=\"NOT OPERATIONAL\",\"X\",IF(Data!Q479=\"OPERATIONAL\",\"W\",\"R\"))","v":"W"},{"$f":"Data!N479","v":"DS FU "}]
[null,{"$f":"Data!K480","v":"IPSWICH"},{"$f":"Data!D480","v":"GB7DI"},{"$f":"Data!F480","v":439.46249999999998},-9,{"$f":"Data!G480","v":430.46249999999998},{"$f":"Data!L480","v":"EA"},{"$f":"Data!M480","v":110.9},{"$f":"IF(Data!Q480=\"NOT OPERATIONAL\",\"X\",IF(Data!Q480=\"OPERATIONAL\",\"W\",\"R\"))","v":"W"},{"$f":"Data!N480","v":"A DS "}]
[null,{"$f":"Data!K481","v":"NORTHWICH"},{"$f":"Data!D481","v":"GB7DJ"},{"$f":"Data!F481","v":439.66250000000002},-9,{"$f":"Data!G481","v":430.66250000000002},{"$f":"Data!L481","v":"NOR"},{"$f":"Data!M481","v":0},{"$f":"IF(Data!Q481=\"NOT OPERATIONAL\",\"X\",IF(Data!Q481=\"OPERATIONAL\",\"W\",\"R\"))","v":"X"},{"$f":"Data!N481","v":"DM "}]
[null,{"$f":"Data!K482","v":"STRANRAER"},{"$f":"Data!D482","v":"GB7DK"},{"$f":"Data!F482","v":145.6875},-0.59999999999999432,{"$f":"Data!G482","v":145.08750000000001},{"$f":"Data!L482","v":"SCO"},{"$f":"Data!M482","v":103.5},{"$f":"IF(Data!Q482=\"NOT OPERATIONAL\",\"X\",IF(Data!Q482=\"OPERATIONAL\",\"W\",\"R\"))","v":"X"},{"$f":"Data!N482","v":"A FU "}]
[null,{"$f":"Data!K483","v":"STRANRAER"},{"$f":"Data!D483","v":"GB7DK-B"},{"$f":"Data!F483","v":439.65},-9,{"$f":"Data!G483","v":430.65},{"$f":"Data!L483","v":"SCO"},{"$f":"Data!M483","v":0},{"$f":"IF(Data!Q483=\"NOT OPERATIONAL\",\"X\",IF(Data!Q483=\"OPERATIONAL\",\"W\",\"R\"))","v":"W"},{"$f":"Data!N483","v":"DS "}]
[null,{"$f":"Data!K484","v":"SKEGNESS"},{"$f":"Data!D484","v":"GB7DL"},{"$f":"Data!F484","v":439.67500000000001},-9,{"$f":"Data!G484","v":430.67500000000001},{"$f":"Data!L484","v":"EA"},{"$f":"Data!M484","v":0},{"$f":"IF(Data!Q484=\"NOT OPERATIONAL\",\"X\",IF(Data!Q484=\"OPERATIONAL\",\"W\",\"R\"))","v":"W"},{"$f":"Data!N484","v":"DS "}]
[null,{"$f":"Data!K485","v":"MONIFIETH"},{"$f":"Data!D485","v":"GB7DM"},{"$f":"Data!F485","v":439.75},-9,{"$f":"Data!G485","v":430.75},{"$f":"Data!L485","v":"SCO"},{"$f":"Data!M485","v":103.5},{"$f":"IF(Data!Q485=\"NOT OPERATIONAL\",\"X\",IF(Data!Q485=\"OPERATIONAL\",\"W\",\"R\"))","v":"W"},{"$f":"Data!N485","v":"A DM DS FU "}]
[null,{"$f":"Data!K486","v":"DUNGIVEN"},{"$f":"Data!D486","v":"GB7DN"},{"$f":"Data!F486","v":439.41250000000002},-9,{"$f":"Data!G486","v":430.41250000000002},{"$f":"Data!L486","v":"NI"},{"$f":"Data!M486","v":0},{"$f":"IF(Data!Q486=\"NOT OPERATIONAL\",\"X\",IF(Data!Q486=\"OPERATIONAL\",\"W\",\"R\"))","v":"W"},{"$f":"Data!N486","v":"DS "}]
[null,{"$f":"Data!K487","v":"DONCASTER"},{"$f":"Data!D487","v":"GB7DO"},{"$f":"Data!F487","v":439.7},-9,{"$f":"Data!G487","v":430.7},{"$f":"Data!L487","v":"NOR"},{"$f":"Data!M487","v":0},{"$f":"IF(Data!Q487=\"NOT OPERATIONAL\",\"X\",IF(Data!Q487=\"OPERATIONAL\",\"W\",\"R\"))","v":"W"},{"$f":"Data!N487","v":"DM "}]
[null,{"$f":"Data!K488","v":"TREFFGARNE"},{"$f":"Data!D488","v":"GB7DP"},{"$f":"Data!F488","v":439.58749999999998},-9,{"$f":"Data!G488","v":430.58749999999998},{"$f":"Data!L488","v":"WM"},{"$f":"Data!M488","v":0},{"$f":"IF(Data!Q488=\"NOT OPERATIONAL\",\"X\",IF(Data!Q488=\"OPERATIONAL\",\"W\",\"R\"))","v":"X"},{"$f":"Data!N488","v":"DM "}]
[null,{"$f":"Data!K489","v":"POOLE"},{"$f":"Data!D489","v":"GB7DR"},{"$f":"Data!F489","v":439.42500000000001},-9,{"$f":"Data!G489","v":430.42500000000001},{"$f":"Data!L489","v":"SW"},{"$f":"Data!M489","v":0},{"$f":"IF(Data!Q489=\"NOT OPERATIONAL\",\"X\",IF(Data!Q489=\"OPERATIONAL\",\"W\",\"R\"))","v":"W"},{"$f":"Data!N489","v":"DM "}]
[null,{"$f":"Data!K490","v":"BURY ST EDMUNDS"},{"$f":"Data!D490","v":"GB7DS"},{"$f":"Data!F490","v":433.3},5,{"$f":"Data!G490","v":438.3},{"$f":"Data!L490","v":"EA"},{"$f":"Data!M490","v":0},{"$f":"IF(Data!Q490=\"NOT OPERATIONAL\",\"X\",IF(Data!Q490=\"OPERATIONAL\",\"W\",\"R\"))","v":"W"},{"$f":"Data!N490","v":"DS "}]
[null,{"$f":"Data!K491","v":"ROCHE"},{"$f":"Data!D491","v":"GB7DT"},{"$f":"Data!F491","v":430.9375},7.6000000000000227,{"$f":"Data!G491","v":438.53750000000002},{"$f":"Data!L491","v":"SW"},{"$f":"Data!M491","v":0},{"$f":"IF(Data!Q491=\"NOT OPERATIONAL\",\"X\",IF(Data!Q491=\"OPERATIONAL\",\"W\",\"R\"))","v":"W"},{"$f":"Data!N491","v":"DM "}]
[null,{"$f":"Data!K492","v":"NEW ROMNEY"},{"$f":"Data!D492","v":"GB7DX"},{"$f":"Data!F492","v":439.7},-9,{"$f":"Data!G492","v":430.7},{"$f":"Data!L492","v":"SE"},{"$f":"Data!M492","v":0},{"$f":"IF(Data!Q492=\"NOT OPERATIONAL\",\"X\",IF(Data!Q492=\"OPERATIONAL\",\"W\",\"R\"))","v":"W"},{"$f":"Data!N492","v":"DM DS "}]
[null,{"$f":"Data!K493","v":"DUDLEY"},{"$f":"Data!D493","v":"GB7DY"},{"$f":"Data!F493","v":439.57499999999999},-9,{"$f":"Data!G493","v":430.57499999999999},{"$f":"Data!L493","v":"MID"},{"$f":"Data!M493","v":0},{"$f":"IF(Data!Q493=\"NOT OPERATIONAL\",\"X\",IF(Data!Q493=\"OPERATIONAL\",\"W\",\"R\"))","v":"W"},{"$f":"Data!N493","v":"DM "}]
[null,{"$f":"Data!K494","v":"CONGLETON"},{"$f":"Data!D494","v":"GB7DZ"},{"$f":"Data!F494","v":433.05},5,{"$f":"Data!G494","v":438.05},{"$f":"Data!L494","v":"MID"},{"$f":"Data!M494","v":103.5},{"$f":"IF(Data!Q494=\"NOT OPERATIONAL\",\"X\",IF(Data!Q494=\"OPERATIONAL\",\"W\",\"R\"))","v":"W"},{"$f":"Data!N494","v":"A FU "}]
[null,{"$f":"Data!K495","v":"ERSKINE"},{"$f":"Data!D495","v":"GB7EA"},{"$f":"Data!F495","v":439.375},-9,{"$f":"Data!G495","v":430.375},{"$f":"Data!L495","v":"SCO"},{"$f":"Data!M495","v":0},{"$f":"IF(Data!Q495=\"NOT OPERATIONAL\",\"X\",IF(Data!Q495=\"OPERATIONAL\",\"W\",\"R\"))","v":"X"},{"$f":"Data!N495","v":"A FU "}]
[null,{"$f":"Data!K496","v":"BECCLES"},{"$f":"Data!D496","v":"GB7EB"},{"$f":"Data!F496","v":439.57499999999999},-9,{"$f":"Data!G496","v":430.57499999999999},{"$f":"Data!L496","v":"EA"},{"$f":"Data!M496","v":0},{"$f":"IF(Data!Q496=\"NOT OPERATIONAL\",\"X\",IF(Data!Q496=\"OPERATIONAL\",\"W\",\"R\"))","v":"W"},{"$f":"Data!N496","v":"DM "}]
[null,{"$f":"Data!K497","v":"ABERDEEN"},{"$f":"Data!D497","v":"GB7EC"},{"$f":"Data!F497","v":430.92500000000001},7.5999999999999659,{"$f":"Data!G497","v":438.52499999999998},{"$f":"Data!L497","v":"SCO"},{"$f":"Data!M497","v":0},{"$f":"IF(Data!Q497=\"NOT OPERATIONAL\",\"X\",IF(Data!Q497=\"OPERATIONAL\",\"W\",\"R\"))","v":"W"},{"$f":"Data!N497","v":"DM "}]
[null,{"$f":"Data!K498","v":"EXETER"},{"$f":"Data!D498","v":"GB7ED"},{"$f":"Data!F498","v":439.67500000000001},-9,{"$f":"Data!G498","v":430.67500000000001},{"$f":"Data!L498","v":"SW"},{"$f":"Data!M498","v":0},{"$f":"IF(Data!Q498=\"NOT OPERATIONAL\",\"X\",IF(Data!Q498=\"OPERATIONAL\",\"W\",\"R\"))","v":"W"},{"$f":"Data!N498","v":"DM "}]
[null,{"$f":"Data!K499","v":"EDINBURGH"},{"$f":"Data!D499","v":"GB7EE"},{"$f":"Data!F499","v":430.92500000000001},7.5999999999999659,{"$f":"Data!G499","v":438.52499999999998},{"$f":"Data!L499","v":"SCO"},{"$f":"Data!M499","v":0},{"$f":"IF(Data!Q499=\"NOT OPERATIONAL\",\"X\",IF(Data!Q499=\"OPERATIONAL\",\"W\",\"R\"))","v":"W"},{"$f":"Data!N499","v":"DM "}]
[null,{"$f":"Data!K500","v":"LADYBANK"},{"$f":"Data!D500","v":"GB7EF"},{"$f":"Data!F500","v":439.45},-9,{"$f":"Data!G500","v":430.45},{"$f":"Data!L500","v":"SCO"},{"$f":"Data!M500","v":103.5},{"$f":"IF(Data!Q500=\"NOT OPERATIONAL\",\"X\",IF(Data!Q500=\"OPERATIONAL\",\"W\",\"R\"))","v":"W"},{"$f":"Data!N500","v":"A DM DS FU NX "}]
[null,{"$f":"Data!K501","v":"EAST GRINSTEAD"},{"$f":"Data!D501","v":"GB7EG"},{"$f":"Data!F501","v":439.76249999999999},-9,{"$f":"Data!G501","v":430.76249999999999},{"$f":"Data!L501","v":"SE"},{"$f":"Data!M501","v":0},{"$f":"IF(Data!Q501=\"NOT OPERATIONAL\",\"X\",IF(Data!Q501=\"OPERATIONAL\",\"W\",\"R\"))","v":"W"},{"$f":"Data!N501","v":"DM "}]
[null,{"$f":"Data!K502","v":"BANBURY"},{"$f":"Data!D502","v":"GB7EH"},{"$f":"Data!F502","v":430.9375},7.6000000000000227,{"$f":"Data!G502","v":438.53750000000002},{"$f":"Data!L502","v":"SW"},{"$f":"Data!M502","v":0},{"$f":"IF(Data!Q502=\"NOT OPERATIONAL\",\"X\",IF(Data!Q502=\"OPERATIONAL\",\"W\",\"R\"))","v":"R"},{"$f":"Data!N502","v":"DM "}]
[null,{"$f":"Data!K503","v":"LOCHMADDY"},{"$f":"Data!D503","v":"GB7EI"},{"$f":"Data!F503","v":430.85},7.5999999999999659,{"$f":"Data!G503","v":438.45},{"$f":"Data!L503","v":"SCO"},{"$f":"Data!M503","v":88.5},{"$f":"IF(Data!Q503=\"NOT OPERATIONAL\",\"X\",IF(Data!Q503=\"OPERATIONAL\",\"W\",\"R\"))","v":"W"},{"$f":"Data!N503","v":"A DM DS FU "}]
[null,{"$f":"Data!K504","v":"NELSON"},{"$f":"Data!D504","v":"GB7EL"},{"$f":"Data!F504","v":439.71249999999998},-9,{"$f":"Data!G504","v":430.71249999999998},{"$f":"Data!L504","v":"NOR"},{"$f":"Data!M504","v":0},{"$f":"IF(Data!Q504=\"NOT OPERATIONAL\",\"X\",IF(Data!Q504=\"OPERATIONAL\",\"W\",\"R\"))","v":"W"},{"$f":"Data!N504","v":"DM "}]
[null,{"$f":"Data!K505","v":"EPSOM"},{"$f":"Data!D505","v":"GB7EP"},{"$f":"Data!F505","v":439.4},-9,{"$f":"Data!G505","v":430.4},{"$f":"Data!L505","v":"SE"},{"$f":"Data!M505","v":0},{"$f":"IF(Data!Q505=\"NOT OPERATIONAL\",\"X\",IF(Data!Q505=\"OPERATIONAL\",\"W\",\"R\"))","v":"W"},{"$f":"Data!N505","v":"DM "}]
[null,{"$f":"Data!K506","v":"ILMINSTER"},{"$f":"Data!D506","v":"GB7EQ"},{"$f":"Data!F506","v":439.45},-9,{"$f":"Data!G506","v":430.45},{"$f":"Data!L506","v":"SW"},{"$f":"Data!M506","v":0},{"$f":"IF(Data!Q506=\"NOT OPERATIONAL\",\"X\",IF(Data!Q506=\"OPERATIONAL\",\"W\",\"R\"))","v":"W"},{"$f":"Data!N506","v":"DM "}]
[null,{"$f":"Data!K507","v":"EXETER"},{"$f":"Data!D507","v":"GB7ER"},{"$f":"Data!F507","v":145.77500000000001},-0.59999999999999432,{"$f":"Data!G507","v":145.17500000000001},{"$f":"Data!L507","v":"SW"},{"$f":"Data!M507","v":77},{"$f":"IF(Data!Q507=\"NOT OPERATIONAL\",\"X\",IF(Data!Q507=\"OPERATIONAL\",\"W\",\"R\"))","v":"W"},{"$f":"Data!N507","v":"A FU "}]
[null,{"$f":"Data!K508","v":"EASTBOURNE"},{"$f":"Data!D508","v":"GB7ES"},{"$f":"Data!F508","v":439.4375},-9,{"$f":"Data!G508","v":430.4375},{"$f":"Data!L508","v":"SE"},{"$f":"Data!M508","v":0},{"$f":"IF(Data!Q508=\"NOT OPERATIONAL\",\"X\",IF(Data!Q508=\"OPERATIONAL\",\"W\",\"R\"))","v":"W"},{"$f":"Data!N508","v":"DS "}]
[null,{"$f":"Data!K509","v":"EDINBURGH"},{"$f":"Data!D509","v":"GB7EU"},{"$f":"Data!F509","v":430.83749999999998},7.6000000000000227,{"$f":"Data!G509","v":438.4375},{"$f":"Data!L509","v":"SCO"},{"$f":"Data!M509","v":94.8},{"$f":"IF(Data!Q509=\"NOT OPERATIONAL\",\"X\",IF(Data!Q509=\"OPERATIONAL\",\"W\",\"R\"))","v":"R"},{"$f":"Data!N509","v":"A DM NX "}]
[null,{"$f":"Data!K510","v":"EDINBURGH"},{"$f":"Data!D510","v":"GB7EV"},{"$f":"Data!F510","v":431.17500000000001},0,{"$f":"Data!G510","v":431.17500000000001},{"$f":"Data!L510","v":"SCO"},{"$f":"Data!M510","v":0},{"$f":"IF(Data!Q510=\"NOT OPERATIONAL\",\"X\",IF(Data!Q510=\"OPERATIONAL\",\"W\",\"R\"))","v":"X"},{"$f":"Data!N510","v":"DM "}]
[null,{"$f":"Data!K511","v":"EXETER"},{"$f":"Data!D511","v":"GB7EW"},{"$f":"Data!F511","v":439.52499999999998},-9,{"$f":"Data!G511","v":430.52499999999998},{"$f":"Data!L511","v":"SW"},{"$f":"Data!M511","v":0},{"$f":"IF(Data!Q511=\"NOT OPERATIONAL\",\"X\",IF(Data!Q511=\"OPERATIONAL\",\"W\",\"R\"))","v":"W"},{"$f":"Data!N511","v":"DM "}]
[null,{"$f":"Data!K512","v":"SOUTHEND ON SEA"},{"$f":"Data!D512","v":"GB7EX"},{"$f":"Data!F512","v":439.71249999999998},-9,{"$f":"Data!G512","v":430.71249999999998},{"$f":"Data!L512","v":"SE"},{"$f":"Data!M512","v":0},{"$f":"IF(Data!Q512=\"NOT OPERATIONAL\",\"X\",IF(Data!Q512=\"OPERATIONAL\",\"W\",\"R\"))","v":"W"},{"$f":"Data!N512","v":"DM "}]
[null,{"$f":"Data!K513","v":"SELKIRK"},{"$f":"Data!D513","v":"GB7EY"},{"$f":"Data!F513","v":439.51249999999999},-9,{"$f":"Data!G513","v":430.51249999999999},{"$f":"Data!L513","v":"SCO"},{"$f":"Data!M513","v":0},{"$f":"IF(Data!Q513=\"NOT OPERATIONAL\",\"X\",IF(Data!Q513=\"OPERATIONAL\",\"W\",\"R\"))","v":"X"},{"$f":"Data!N513","v":"DM DS FU NX "}]
[null,{"$f":"Data!K514","v":"CASTLE BROMWICH"},{"$f":"Data!D514","v":"GB7EZ"},{"$f":"Data!F514","v":439.77499999999998},-9,{"$f":"Data!G514","v":430.77499999999998},{"$f":"Data!L514","v":"MID"},{"$f":"Data!M514","v":0},{"$f":"IF(Data!Q514=\"NOT OPERATIONAL\",\"X\",IF(Data!Q514=\"OPERATIONAL\",\"W\",\"R\"))","v":"W"},{"$f":"Data!N514","v":"DM "}]
[null,{"$f":"Data!K515","v":"BIDEFORD"},{"$f":"Data!D515","v":"GB7FB"},{"$f":"Data!F515","v":439.47500000000002},-9,{"$f":"Data!G515","v":430.47500000000002},{"$f":"Data!L515","v":"SW"},{"$f":"Data!M515","v":0},{"$f":"IF(Data!Q515=\"NOT OPERATIONAL\",\"X\",IF(Data!Q515=\"OPERATIONAL\",\"W\",\"R\"))","v":"W"},{"$f":"Data!N515","v":"DM "}]
[null,{"$f":"Data!K516","v":"CLEVELEYS"},{"$f":"Data!D516","v":"GB7FC"},{"$f":"Data!F516","v":439.5},-9,{"$f":"Data!G516","v":430.5},{"$f":"Data!L516","v":"NOR"},{"$f":"Data!M516","v":0},{"$f":"IF(Data!Q516=\"NOT OPERATIONAL\",\"X\",IF(Data!Q516=\"OPERATIONAL\",\"W\",\"R\"))","v":"W"},{"$f":"Data!N516","v":"DS "}]
[null,{"$f":"Data!K517","v":"STIRLING"},{"$f":"Data!D517","v":"GB7FE"},{"$f":"Data!F517","v":439.47500000000002},-9,{"$f":"Data!G517","v":430.47500000000002},{"$f":"Data!L517","v":"SCO"},{"$f":"Data!M517","v":0},{"$f":"IF(Data!Q517=\"NOT OPERATIONAL\",\"X\",IF(Data!Q517=\"OPERATIONAL\",\"W\",\"R\"))","v":"W"},{"$f":"Data!N517","v":"DM DS FU "}]
[null,{"$f":"Data!K518","v":"PRESTONPANS"},{"$f":"Data!D518","v":"GB7FF"},{"$f":"Data!F518","v":145.73750000000001},-0.60000000000002274,{"$f":"Data!G518","v":145.13749999999999},{"$f":"Data!L518","v":"SCO"},{"$f":"Data!M518","v":103.5},{"$f":"IF(Data!Q518=\"NOT OPERATIONAL\",\"X\",IF(Data!Q518=\"OPERATIONAL\",\"W\",\"R\"))","v":"X"},{"$f":"Data!N518","v":"A DM DS FU NX "}]
[null,{"$f":"Data!K519","v":"CARMARTHEN"},{"$f":"Data!D519","v":"GB7FG"},{"$f":"Data!F519","v":430.95},7.6000000000000227,{"$f":"Data!G519","v":438.55},{"$f":"Data!L519","v":"WM"},{"$f":"Data!M519","v":94.8},{"$f":"IF(Data!Q519=\"NOT OPERATIONAL\",\"X\",IF(Data!Q519=\"OPERATIONAL\",\"W\",\"R\"))","v":"W"},{"$f":"Data!N519","v":"A FU "}]
[null,{"$f":"Data!K520","v":"AXBRIDGE"},{"$f":"Data!D520","v":"GB7FI"},{"$f":"Data!F520","v":430.88749999999999},7.6000000000000227,{"$f":"Data!G520","v":438.48750000000001},{"$f":"Data!L520","v":"SW"},{"$f":"Data!M520","v":0},{"$f":"IF(Data!Q520=\"NOT OPERATIONAL\",\"X\",IF(Data!Q520=\"OPERATIONAL\",\"W\",\"R\"))","v":"W"},{"$f":"Data!N520","v":"DM "}]
[null,{"$f":"Data!K521","v":"FOLKESTONE"},{"$f":"Data!D521","v":"GB7FK-B"},{"$f":"Data!F521","v":439.67500000000001},{"$f":"F521-D521","v":-9},{"$f":"Data!G521","v":430.67500000000001},{"$f":"Data!L521","v":"SE"},{"$f":"Data!M521","v":0},{"$f":"IF(Data!Q521=\"NOT OPERATIONAL\",\"X\",IF(Data!Q521=\"OPERATIONAL\",\"W\",\"R\"))","v":"W"},{"$f":"Data!N521","v":"DS "}]
[null,{"$f":"Data!K522","v":"FRECKLETON"},{"$f":"Data!D522","v":"GB7FL"},{"$f":"Data!F522","v":439.76249999999999},-9,{"$f":"Data!G522","v":430.76249999999999},{"$f":"Data!L522","v":"NOR"},{"$f":"Data!M522","v":0},{"$f":"IF(Data!Q522=\"NOT OPERATIONAL\",\"X\",IF(Data!Q522=\"OPERATIONAL\",\"W\",\"R\"))","v":"W"},{"$f":"Data!N522","v":"DS FU "}]
[null,{"$f":"Data!K523","v":"BLACKPOOL"},{"$f":"Data!D523","v":"GB7FO"},{"$f":"Data!F523","v":430.27499999999998},9,{"$f":"Data!G523","v":439.27499999999998},{"$f":"Data!L523","v":"NOR"},{"$f":"Data!M523","v":0},{"$f":"IF(Data!Q523=\"NOT OPERATIONAL\",\"X\",IF(Data!Q523=\"OPERATIONAL\",\"W\",\"R\"))","v":"W"},{"$f":"Data!N523","v":"DM "}]
[null,{"$f":"Data!K524","v":"BARNHAM"},{"$f":"Data!D524","v":"GB7FR"},{"$f":"Data!F524","v":439.5},-9,{"$f":"Data!G524","v":430.5},{"$f":"Data!L524","v":"SW"},{"$f":"Data!M524","v":0},{"$f":"IF(Data!Q524=\"NOT OPERATIONAL\",\"X\",IF(Data!Q524=\"OPERATIONAL\",\"W\",\"R\"))","v":"X"},{"$f":"Data!N524","v":"DM "}]
[null,{"$f":"Data!K525","v":"BARNHAM"},{"$f":"Data!D525","v":"GB7FR"},{"$f":"Data!F525","v":145.71250000000001},-0.59999999999999432,{"$f":"Data!G525","v":145.11250000000001},{"$f":"Data!L525","v":"SW"},{"$f":"Data!M525","v":0},{"$f":"IF(Data!Q525=\"NOT OPERATIONAL\",\"X\",IF(Data!Q525=\"OPERATIONAL\",\"W\",\"R\"))","v":"X"},{"$f":"Data!N525","v":"A DM DS FU NX "}]
[null,{"$f":"Data!K526","v":"BILSTON"},{"$f":"Data!D526","v":"GB7FS"},{"$f":"Data!F526","v":439.42500000000001},-9,{"$f":"Data!G526","v":430.42500000000001},{"$f":"Data!L526","v":"MID"},{"$f":"Data!M526","v":0},{"$f":"IF(Data!Q526=\"NOT OPERATIONAL\",\"X\",IF(Data!Q526=\"OPERATIONAL\",\"W\",\"R\"))","v":"W"},{"$f":"Data!N526","v":"FU "}]
[null,{"$f":"Data!K527","v":"PORTSMOUTH"},{"$f":"Data!D527","v":"GB7FT"},{"$f":"Data!F527","v":439.71249999999998},-9,{"$f":"Data!G527","v":430.71249999999998},{"$f":"Data!L527","v":"SW"},{"$f":"Data!M527","v":0},{"$f":"IF(Data!Q527=\"NOT OPERATIONAL\",\"X\",IF(Data!Q527=\"OPERATIONAL\",\"W\",\"R\"))","v":"W"},{"$f":"Data!N527","v":"DM "}]
[null,{"$f":"Data!K528","v":"NOTTINGHAM"},{"$f":"Data!D528","v":"GB7FU"},{"$f":"Data!F528","v":430.88749999999999},7.6000000000000227,{"$f":"Data!G528","v":438.48750000000001},{"$f":"Data!L528","v":"MID"},{"$f":"Data!M528","v":0},{"$f":"IF(Data!Q528=\"NOT OPERATIONAL\",\"X\",IF(Data!Q528=\"OPERATIONAL\",\"W\",\"R\"))","v":"W"},{"$f":"Data!N528","v":"A FU "}]
[null,{"$f":"Data!K529","v":"PORTSMOUTH"},{"$f":"Data!D529","v":"GB7FW"},{"$f":"Data!F529","v":439.67500000000001},-9,{"$f":"Data!G529","v":430.67500000000001},{"$f":"Data!L529","v":"SW"},{"$f":"Data!M529","v":0},{"$f":"IF(Data!Q529=\"NOT OPERATIONAL\",\"X\",IF(Data!Q529=\"OPERATIONAL\",\"W\",\"R\"))","v":"X"},{"$f":"Data!N529","v":"DS "}]
[null,{"$f":"Data!K530","v":"CHATHAM"},{"$f":"Data!D530","v":"GB7FX"},{"$f":"Data!F530","v":433.125},5,{"$f":"Data!G530","v":438.125},{"$f":"Data!L530","v":"SE"},{"$f":"Data!M530","v":74.400000000000006},{"$f":"IF(Data!Q530=\"NOT OPERATIONAL\",\"X\",IF(Data!Q530=\"OPERATIONAL\",\"W\",\"R\"))","v":"W"},{"$f":"Data!N530","v":"DM "}]
[null,{"$f":"Data!K531","v":"GALASHIELS"},{"$f":"Data!D531","v":"GB7GA"},{"$f":"Data!F531","v":430.9},7.6000000000000227,{"$f":"Data!G531","v":438.5},{"$f":"Data!L531","v":"SCO"},{"$f":"Data!M531","v":118.8},{"$f":"IF(Data!Q531=\"NOT OPERATIONAL\",\"X\",IF(Data!Q531=\"OPERATIONAL\",\"W\",\"R\"))","v":"X"},{"$f":"Data!N531","v":"A DM DS FU "}]
[null,{"$f":"Data!K532","v":"SUTTON COLDFIELD"},{"$f":"Data!D532","v":"GB7GB"},{"$f":"Data!F532","v":439.76249999999999},-9,{"$f":"Data!G532","v":430.76249999999999},{"$f":"Data!L532","v":"MID"},{"$f":"Data!M532","v":0},{"$f":"IF(Data!Q532=\"NOT OPERATIONAL\",\"X\",IF(Data!Q532=\"OPERATIONAL\",\"W\",\"R\"))","v":"R"},{"$f":"Data!N532","v":"DM "}]
[null,{"$f":"Data!K533","v":"ABERDEEN"},{"$f":"Data!D533","v":"GB7GD"},{"$f":"Data!F533","v":145.6875},-0.59999999999999432,{"$f":"Data!G533","v":145.08750000000001},{"$f":"Data!L533","v":"SCO"},{"$f":"Data!M533","v":0},{"$f":"IF(Data!Q533=\"NOT OPERATIONAL\",\"X\",IF(Data!Q533=\"OPERATIONAL\",\"W\",\"R\"))","v":"W"},{"$f":"Data!N533","v":"DM DS FU "}]
[null,{"$f":"Data!K534","v":"GUILDFORD"},{"$f":"Data!D534","v":"GB7GF"},{"$f":"Data!F534","v":439.6875},-9,{"$f":"Data!G534","v":430.6875},{"$f":"Data!L534","v":"SW"},{"$f":"Data!M534","v":0},{"$f":"IF(Data!Q534=\"NOT OPERATIONAL\",\"X\",IF(Data!Q534=\"OPERATIONAL\",\"W\",\"R\"))","v":"W"},{"$f":"Data!N534","v":"DM "}]
[null,{"$f":"Data!K535","v":"AIRDRIE"},{"$f":"Data!D535","v":"GB7GG"},{"$f":"Data!F535","v":439.625},-9,{"$f":"Data!G535","v":430.625},{"$f":"Data!L535","v":"SCO"},{"$f":"Data!M535","v":0},{"$f":"IF(Data!Q535=\"NOT OPERATIONAL\",\"X\",IF(Data!Q535=\"OPERATIONAL\",\"W\",\"R\"))","v":"W"},{"$f":"Data!N535","v":"DM DS FU "}]
[null,{"$f":"Data!K536","v":"CHURCHDOWN"},{"$f":"Data!D536","v":"GB7GH"},{"$f":"Data!F536","v":439.61250000000001},-9,{"$f":"Data!G536","v":430.61250000000001},{"$f":"Data!L536","v":"SW"},{"$f":"Data!M536","v":0},{"$f":"IF(Data!Q536=\"NOT OPERATIONAL\",\"X\",IF(Data!Q536=\"OPERATIONAL\",\"W\",\"R\"))","v":"X"},{"$f":"Data!N536","v":"DM NX "}]
[null,{"$f":"Data!K537","v":"ST HELIER"},{"$f":"Data!D537","v":"GB7GJ"},{"$f":"Data!F537","v":430.9},7.6000000000000227,{"$f":"Data!G537","v":438.5},{"$f":"Data!L537","v":"SW"},{"$f":"Data!M537","v":88.5},{"$f":"IF(Data!Q537=\"NOT OPERATIONAL\",\"X\",IF(Data!Q537=\"OPERATIONAL\",\"W\",\"R\"))","v":"W"},{"$f":"Data!N537","v":"A DM "}]
[null,{"$f":"Data!K538","v":"KEITH"},{"$f":"Data!D538","v":"GB7GK"},{"$f":"Data!F538","v":439.48750000000001},-9,{"$f":"Data!G538","v":430.48750000000001},{"$f":"Data!L538","v":"SCO"},{"$f":"Data!M538","v":0},{"$f":"IF(Data!Q538=\"NOT OPERATIONAL\",\"X\",IF(Data!Q538=\"OPERATIONAL\",\"W\",\"R\"))","v":"W"},{"$f":"Data!N538","v":"DM "}]
[null,{"$f":"Data!K539","v":"GLASGOW"},{"$f":"Data!D539","v":"GB7GL"},{"$f":"Data!F539","v":430.85},7.5999999999999659,{"$f":"Data!G539","v":438.45},{"$f":"Data!L539","v":"SCO"},{"$f":"Data!M539","v":0},{"$f":"IF(Data!Q539=\"NOT OPERATIONAL\",\"X\",IF(Data!Q539=\"OPERATIONAL\",\"W\",\"R\"))","v":"W"},{"$f":"Data!N539","v":"DM "}]
[null,{"$f":"Data!K540","v":"DUMFRIES"},{"$f":"Data!D540","v":"GB7GM"},{"$f":"Data!F540","v":430.97500000000002},7.5999999999999659,{"$f":"Data!G540","v":438.57499999999999},{"$f":"Data!L540","v":"SCO"},{"$f":"Data!M540","v":118.8},{"$f":"IF(Data!Q540=\"NOT OPERATIONAL\",\"X\",IF(Data!Q540=\"OPERATIONAL\",\"W\",\"R\"))","v":"W"},{"$f":"Data!N540","v":"A DM DS FU "}]
[null,{"$f":"Data!K541","v":"HIGH WYCOMBE"},{"$f":"Data!D541","v":"GB7GP"},{"$f":"Data!F541","v":439.65},-9,{"$f":"Data!G541","v":430.65},{"$f":"Data!L541","v":"SE"},{"$f":"Data!M541","v":0},{"$f":"IF(Data!Q541=\"NOT OPERATIONAL\",\"X\",IF(Data!Q541=\"OPERATIONAL\",\"W\",\"R\"))","v":"W"},{"$f":"Data!N541","v":"DM FU "}]
[null,{"$f":"Data!K542","v":"GRANTHAM"},{"$f":"Data!D542","v":"GB7GR"},{"$f":"Data!F542","v":439.45},-9,{"$f":"Data!G542","v":430.45},{"$f":"Data!L542","v":"MID"},{"$f":"Data!M542","v":0},{"$f":"IF(Data!Q542=\"NOT OPERATIONAL\",\"X\",IF(Data!Q542=\"OPERATIONAL\",\"W\",\"R\"))","v":"W"},{"$f":"Data!N542","v":"DM DS FU "}]
[null,{"$f":"Data!K543","v":"DOWNHAM MARKET"},{"$f":"Data!D543","v":"GB7GS"},{"$f":"Data!F543","v":439.45},-9,{"$f":"Data!G543","v":430.45},{"$f":"Data!L543","v":"EA"},{"$f":"Data!M543","v":0},{"$f":"IF(Data!Q543=\"NOT OPERATIONAL\",\"X\",IF(Data!Q543=\"OPERATIONAL\",\"W\",\"R\"))","v":"W"},{"$f":"Data!N543","v":"DM FU "}]
[null,{"$f":"Data!K544","v":"CLEE HILL"},{"$f":"Data!D544","v":"GB7GT"},{"$f":"Data!F544","v":439.41250000000002},-9,{"$f":"Data!G544","v":430.41250000000002},{"$f":"Data!L544","v":"MID"},{"$f":"Data!M544","v":0},{"$f":"IF(Data!Q544=\"NOT OPERATIONAL\",\"X\",IF(Data!Q544=\"OPERATIONAL\",\"W\",\"R\"))","v":"W"},{"$f":"Data!N544","v":"DM "}]
[null,{"$f":"Data!K545","v":"WASHINGTON"},{"$f":"Data!D545","v":"GB7GW"},{"$f":"Data!F545","v":430.8125},7.6000000000000227,{"$f":"Data!G545","v":438.41250000000002},{"$f":"Data!L545","v":"NOR"},{"$f":"Data!M545","v":103.5},{"$f":"IF(Data!Q545=\"NOT OPERATIONAL\",\"X\",IF(Data!Q545=\"OPERATIONAL\",\"W\",\"R\"))","v":"W"},{"$f":"Data!N545","v":"A DM DS FU "}]
[null,{"$f":"Data!K546","v":"PRESTONPANS "},{"$f":"Data!D546","v":"GB7GX"},{"$f":"Data!F546","v":439.36250000000001},-9,{"$f":"Data!G546","v":430.36250000000001},{"$f":"Data!L546","v":"SCO"},{"$f":"Data!M546","v":103.5},{"$f":"IF(Data!Q546=\"NOT OPERATIONAL\",\"X\",IF(Data!Q546=\"OPERATIONAL\",\"W\",\"R\"))","v":"W"},{"$f":"Data!N546","v":"A DM DS FU NX "}]
[null,{"$f":"Data!K547","v":"ST. PETER PORT"},{"$f":"Data!D547","v":"GB7GY"},{"$f":"Data!F547","v":439.6875},-9,{"$f":"Data!G547","v":430.6875},{"$f":"Data!L547","v":"SW"},{"$f":"Data!M547","v":0},{"$f":"IF(Data!Q547=\"NOT OPERATIONAL\",\"X\",IF(Data!Q547=\"OPERATIONAL\",\"W\",\"R\"))","v":"W"},{"$f":"Data!N547","v":"DM "}]
[null,{"$f":"Data!K548","v":"HARPENDEN"},{"$f":"Data!D548","v":"GB7HA"},{"$f":"Data!F548","v":430.28750000000002},9,{"$f":"Data!G548","v":439.28750000000002},{"$f":"Data!L548","v":"SE"},{"$f":"Data!M548","v":0},{"$f":"IF(Data!Q548=\"NOT OPERATIONAL\",\"X\",IF(Data!Q548=\"OPERATIONAL\",\"W\",\"R\"))","v":"W"},{"$f":"Data!N548","v":"DM DS FU "}]
[null,{"$f":"Data!K549","v":"TANDRAGEE"},{"$f":"Data!D549","v":"GB7HB"},{"$f":"Data!F549","v":439.625},-9,{"$f":"Data!G549","v":430.625},{"$f":"Data!L549","v":"NI"},{"$f":"Data!M549","v":0},{"$f":"IF(Data!Q549=\"NOT OPERATIONAL\",\"X\",IF(Data!Q549=\"OPERATIONAL\",\"W\",\"R\"))","v":"W"},{"$f":"Data!N549","v":"DM DS FU "}]
[null,{"$f":"Data!K550","v":"HEREFORD"},{"$f":"Data!D550","v":"GB7HC"},{"$f":"Data!F550","v":439.52499999999998},-9,{"$f":"Data!G550","v":430.52499999999998},{"$f":"Data!L550","v":"MID"},{"$f":"Data!M550","v":0},{"$f":"IF(Data!Q550=\"NOT OPERATIONAL\",\"X\",IF(Data!Q550=\"OPERATIONAL\",\"W\",\"R\"))","v":"W"},{"$f":"Data!N550","v":"DM "}]
[null,{"$f":"Data!K551","v":"TAVISTOCK"},{"$f":"Data!D551","v":"GB7HD"},{"$f":"Data!F551","v":145.6875},-0.59999999999999432,{"$f":"Data!G551","v":145.08750000000001},{"$f":"Data!L551","v":"SW"},{"$f":"Data!M551","v":0},{"$f":"IF(Data!Q551=\"NOT OPERATIONAL\",\"X\",IF(Data!Q551=\"OPERATIONAL\",\"W\",\"R\"))","v":"W"},{"$f":"Data!N551","v":"DM "}]
[null,{"$f":"Data!K552","v":"NEWTON ABBOT"},{"$f":"Data!D552","v":"GB7HF"},{"$f":"Data!F552","v":439.5},-9,{"$f":"Data!G552","v":430.5},{"$f":"Data!L552","v":"SW"},{"$f":"Data!M552","v":0},{"$f":"IF(Data!Q552=\"NOT OPERATIONAL\",\"X\",IF(Data!Q552=\"OPERATIONAL\",\"W\",\"R\"))","v":"W"},{"$f":"Data!N552","v":"DM "}]
[null,{"$f":"Data!K553","v":"ROMFORD"},{"$f":"Data!D553","v":"GB7HH"},{"$f":"Data!F553","v":439.75},-9,{"$f":"Data!G553","v":430.75},{"$f":"Data!L553","v":"SE"},{"$f":"Data!M553","v":0},{"$f":"IF(Data!Q553=\"NOT OPERATIONAL\",\"X\",IF(Data!Q553=\"OPERATIONAL\",\"W\",\"R\"))","v":"W"},{"$f":"Data!N553","v":"DM DS FU "}]
[null,{"$f":"Data!K554","v":"LISBURN"},{"$f":"Data!D554","v":"GB7HI"},{"$f":"Data!F554","v":439.5625},-9,{"$f":"Data!G554","v":430.5625},{"$f":"Data!L554","v":"NI"},{"$f":"Data!M554","v":0},{"$f":"IF(Data!Q554=\"NOT OPERATIONAL\",\"X\",IF(Data!Q554=\"OPERATIONAL\",\"W\",\"R\"))","v":"W"},{"$f":"Data!N554","v":"FU "}]
[null,{"$f":"Data!K555","v":"HAWICK"},{"$f":"Data!D555","v":"GB7HK"},{"$f":"Data!F555","v":145.625},-0.59999999999999432,{"$f":"Data!G555","v":145.02500000000001},{"$f":"Data!L555","v":"SCO"},{"$f":"Data!M555","v":103.5},{"$f":"IF(Data!Q555=\"NOT OPERATIONAL\",\"X\",IF(Data!Q555=\"OPERATIONAL\",\"W\",\"R\"))","v":"X"},{"$f":"Data!N555","v":"A DM "}]
[null,{"$f":"Data!K556","v":"CAERGWRLE"},{"$f":"Data!D556","v":"GB7HM"},{"$f":"Data!F556","v":439.63749999999999},-9,{"$f":"Data!G556","v":430.63749999999999},{"$f":"Data!L556","v":"WM"},{"$f":"Data!M556","v":0},{"$f":"IF(Data!Q556=\"NOT OPERATIONAL\",\"X\",IF(Data!Q556=\"OPERATIONAL\",\"W\",\"R\"))","v":"W"},{"$f":"Data!N556","v":"DM "}]
[null,{"$f":"Data!K557","v":"LEIGH"},{"$f":"Data!D557","v":"GB7HN"},{"$f":"Data!F557","v":430.875},7.6000000000000227,{"$f":"Data!G557","v":438.47500000000002},{"$f":"Data!L557","v":"NOR"},{"$f":"Data!M557","v":82.5},{"$f":"IF(Data!Q557=\"NOT OPERATIONAL\",\"X\",IF(Data!Q557=\"OPERATIONAL\",\"W\",\"R\"))","v":"W"},{"$f":"Data!N557","v":"A "}]
[null,{"$f":"Data!K558","v":"HUTHWAITE"},{"$f":"Data!D558","v":"GB7HQ"},{"$f":"Data!F558","v":145.66249999999999},-0.59999999999999432,{"$f":"Data!G558","v":145.0625},{"$f":"Data!L558","v":"MID"},{"$f":"Data!M558","v":71.900000000000006},{"$f":"IF(Data!Q558=\"NOT OPERATIONAL\",\"X\",IF(Data!Q558=\"OPERATIONAL\",\"W\",\"R\"))","v":"W"},{"$f":"Data!N558","v":"A DM DS FU NX "}]
[null,{"$f":"Data!K559","v":"HUTHWAITE"},{"$f":"Data!D559","v":"GB7HQ"},{"$f":"Data!F559","v":433.02499999999998},1.6000000000000227,{"$f":"Data!G559","v":434.625},{"$f":"Data!L559","v":"MID"},{"$f":"Data!M559","v":71.900000000000006},{"$f":"IF(Data!Q559=\"NOT OPERATIONAL\",\"X\",IF(Data!Q559=\"OPERATIONAL\",\"W\",\"R\"))","v":"W"},{"$f":"Data!N559","v":"A DM DS FU NX "}]
[null,{"$f":"Data!K560","v":"HEATHROW"},{"$f":"Data!D560","v":"GB7HR"},{"$f":"Data!F560","v":439.45},-9,{"$f":"Data!G560","v":430.45},{"$f":"Data!L560","v":"SE"},{"$f":"Data!M560","v":0},{"$f":"IF(Data!Q560=\"NOT OPERATIONAL\",\"X\",IF(Data!Q560=\"OPERATIONAL\",\"W\",\"R\"))","v":"W"},{"$f":"Data!N560","v":"DM "}]
[null,{"$f":"Data!K561","v":"HEPTONSTALL"},{"$f":"Data!D561","v":"GB7HS"},{"$f":"Data!F561","v":439.42500000000001},-9,{"$f":"Data!G561","v":430.42500000000001},{"$f":"Data!L561","v":"NOR"},{"$f":"Data!M561","v":0},{"$f":"IF(Data!Q561=\"NOT OPERATIONAL\",\"X\",IF(Data!Q561=\"OPERATIONAL\",\"W\",\"R\"))","v":"W"},{"$f":"Data!N561","v":"DM "}]
[null,{"$f":"Data!K562","v":"ASHINGTON"},{"$f":"Data!D562","v":"GB7HT"},{"$f":"Data!F562","v":439.73750000000001},-9,{"$f":"Data!G562","v":430.73750000000001},{"$f":"Data!L562","v":"NOR"},{"$f":"Data!M562","v":0},{"$f":"IF(Data!Q562=\"NOT OPERATIONAL\",\"X\",IF(Data!Q562=\"OPERATIONAL\",\"W\",\"R\"))","v":"W"},{"$f":"Data!N562","v":"DM "}]
[null,{"$f":"Data!K563","v":"SOUTH CAVE"},{"$f":"Data!D563","v":"GB7HU"},{"$f":"Data!F563","v":439.48750000000001},-9,{"$f":"Data!G563","v":430.48750000000001},{"$f":"Data!L563","v":"NOR"},{"$f":"Data!M563","v":0},{"$f":"IF(Data!Q563=\"NOT OPERATIONAL\",\"X\",IF(Data!Q563=\"OPERATIONAL\",\"W\",\"R\"))","v":"R"},{"$f":"Data!N563","v":"DS "}]
[null,{"$f":"Data!K564","v":"HORWICH"},{"$f":"Data!D564","v":"GB7HW"},{"$f":"Data!F564","v":434.01875000000001},0,{"$f":"Data!G564","v":434.01875000000001},{"$f":"Data!L564","v":"NOR"},{"$f":"Data!M564","v":0},{"$f":"IF(Data!Q564=\"NOT OPERATIONAL\",\"X\",IF(Data!Q564=\"OPERATIONAL\",\"W\",\"R\"))","v":"W"},{"$f":"Data!N564","v":""}]
[null,{"$f":"Data!K565","v":"HUDDERSFIELD"},{"$f":"Data!D565","v":"GB7HX"},{"$f":"Data!F565","v":439.57499999999999},-9,{"$f":"Data!G565","v":430.57499999999999},{"$f":"Data!L565","v":"NOR"},{"$f":"Data!M565","v":0},{"$f":"IF(Data!Q565=\"NOT OPERATIONAL\",\"X\",IF(Data!Q565=\"OPERATIONAL\",\"W\",\"R\"))","v":"W"},{"$f":"Data!N565","v":"DM DS "}]
[null,{"$f":"Data!K566","v":"CHORLEY"},{"$f":"Data!D566","v":"GB7HY"},{"$f":"Data!F566","v":439.57499999999999},-9,{"$f":"Data!G566","v":430.57499999999999},{"$f":"Data!L566","v":"NOR"},{"$f":"Data!M566","v":0},{"$f":"IF(Data!Q566=\"NOT OPERATIONAL\",\"X\",IF(Data!Q566=\"OPERATIONAL\",\"W\",\"R\"))","v":"W"},{"$f":"Data!N566","v":"DM "}]
[null,{"$f":"Data!K567","v":"HERNE BAY"},{"$f":"Data!D567","v":"GB7IC-B"},{"$f":"Data!F567","v":439.45},-9,{"$f":"Data!G567","v":430.45},{"$f":"Data!L567","v":"SE"},{"$f":"Data!M567","v":0},{"$f":"IF(Data!Q567=\"NOT OPERATIONAL\",\"X\",IF(Data!Q567=\"OPERATIONAL\",\"W\",\"R\"))","v":"W"},{"$f":"Data!N567","v":"DS "}]
[null,{"$f":"Data!K568","v":"HERNE BAY"},{"$f":"Data!D568","v":"GB7IC-C"},{"$f":"Data!F568","v":145.66249999999999},-0.59999999999999432,{"$f":"Data!G568","v":145.0625},{"$f":"Data!L568","v":"SE"},{"$f":"Data!M568","v":0},{"$f":"IF(Data!Q568=\"NOT OPERATIONAL\",\"X\",IF(Data!Q568=\"OPERATIONAL\",\"W\",\"R\"))","v":"W"},{"$f":"Data!N568","v":"A DS "}]
[null,{"$f":"Data!K569","v":"PLYMOUTH"},{"$f":"Data!D569","v":"GB7IE"},{"$f":"Data!F569","v":145.67500000000001},-0.60000000000002274,{"$f":"Data!G569","v":145.07499999999999},{"$f":"Data!L569","v":"SW"},{"$f":"Data!M569","v":77},{"$f":"IF(Data!Q569=\"NOT OPERATIONAL\",\"X\",IF(Data!Q569=\"OPERATIONAL\",\"W\",\"R\"))","v":"W"},{"$f":"Data!N569","v":"A FU "}]
[null,{"$f":"Data!K570","v":"INVERNESS"},{"$f":"Data!D570","v":"GB7II"},{"$f":"Data!F570","v":439.45},-9,{"$f":"Data!G570","v":430.45},{"$f":"Data!L570","v":"SCO"},{"$f":"Data!M570","v":0},{"$f":"IF(Data!Q570=\"NOT OPERATIONAL\",\"X\",IF(Data!Q570=\"OPERATIONAL\",\"W\",\"R\"))","v":"W"},{"$f":"Data!N570","v":"DM "}]
[null,{"$f":"Data!K571","v":"ROCHESTER"},{"$f":"Data!D571","v":"GB7IK"},{"$f":"Data!F571","v":439.53750000000002},-9,{"$f":"Data!G571","v":430.53750000000002},{"$f":"Data!L571","v":"SE"},{"$f":"Data!M571","v":0},{"$f":"IF(Data!Q571=\"NOT OPERATIONAL\",\"X\",IF(Data!Q571=\"OPERATIONAL\",\"W\",\"R\"))","v":"W"},{"$f":"Data!N571","v":"DM "}]
[null,{"$f":"Data!K572","v":"INVERNESS"},{"$f":"Data!D572","v":"GB7IL"},{"$f":"Data!F572","v":145.66249999999999},-0.59999999999999432,{"$f":"Data!G572","v":145.0625},{"$f":"Data!L572","v":"SCO"},{"$f":"Data!M572","v":0},{"$f":"IF(Data!Q572=\"NOT OPERATIONAL\",\"X\",IF(Data!Q572=\"OPERATIONAL\",\"W\",\"R\"))","v":"X"},{"$f":"Data!N572","v":"DM "}]
[null,{"$f":"Data!K573","v":"TANSLEY NR MATLOCK"},{"$f":"Data!D573","v":"GB7IN"},{"$f":"Data!F573","v":439.65},-9,{"$f":"Data!G573","v":430.65},{"$f":"Data!L573","v":"MID"},{"$f":"Data!M573","v":0},{"$f":"IF(Data!Q573=\"NOT OPERATIONAL\",\"X\",IF(Data!Q573=\"OPERATIONAL\",\"W\",\"R\"))","v":"W"},{"$f":"Data!N573","v":"DM "}]
[null,{"$f":"Data!K574","v":"LIVERTON"},{"$f":"Data!D574","v":"GB7IQ"},{"$f":"Data!F574","v":439.57499999999999},-9,{"$f":"Data!G574","v":430.57499999999999},{"$f":"Data!L574","v":"SW"},{"$f":"Data!M574","v":0},{"$f":"IF(Data!Q574=\"NOT OPERATIONAL\",\"X\",IF(Data!Q574=\"OPERATIONAL\",\"W\",\"R\"))","v":"X"},{"$f":"Data!N574","v":"DM "}]
[null,{"$f":"Data!K575","v":"WESTON-SUPER-MARE"},{"$f":"Data!D575","v":"GB7IS"},{"$f":"Data!F575","v":439.53750000000002},-9,{"$f":"Data!G575","v":430.53750000000002},{"$f":"Data!L575","v":"SW"},{"$f":"Data!M575","v":0},{"$f":"IF(Data!Q575=\"NOT OPERATIONAL\",\"X\",IF(Data!Q575=\"OPERATIONAL\",\"W\",\"R\"))","v":"W"},{"$f":"Data!N575","v":"FU "}]
[null,{"$f":"Data!K576","v":"WESTON-SUPER-MARE"},{"$f":"Data!D576","v":"GB7IT"},{"$f":"Data!F576","v":439.51249999999999},-9,{"$f":"Data!G576","v":430.51249999999999},{"$f":"Data!L576","v":"SW"},{"$f":"Data!M576","v":0},{"$f":"IF(Data!Q576=\"NOT OPERATIONAL\",\"X\",IF(Data!Q576=\"OPERATIONAL\",\"W\",\"R\"))","v":"W"},{"$f":"Data!N576","v":"DM "}]
[null,{"$f":"Data!K577","v":"SOUTHAMPTON"},{"$f":"Data!D577","v":"GB7IV"},{"$f":"Data!F577","v":145.77500000000001},-0.59999999999999432,{"$f":"Data!G577","v":145.17500000000001},{"$f":"Data!L577","v":"SW"},{"$f":"Data!M577","v":0},{"$f":"IF(Data!Q577=\"NOT OPERATIONAL\",\"X\",IF(Data!Q577=\"OPERATIONAL\",\"W\",\"R\"))","v":"W"},{"$f":"Data!N577","v":"FU "}]
[null,{"$f":"Data!K578","v":"WESTCLIFF ON SEA"},{"$f":"Data!D578","v":"GB7IX"},{"$f":"Data!F578","v":430.9375},7.6000000000000227,{"$f":"Data!G578","v":438.53750000000002},{"$f":"Data!L578","v":"SE"},{"$f":"Data!M578","v":110.9},{"$f":"IF(Data!Q578=\"NOT OPERATIONAL\",\"X\",IF(Data!Q578=\"OPERATIONAL\",\"W\",\"R\"))","v":"W"},{"$f":"Data!N578","v":"A DM DS FU NX "}]
[null,{"$f":"Data!K579","v":"MERE  WILTSHIRE"},{"$f":"Data!D579","v":"GB7JA"},{"$f":"Data!F579","v":439.71249999999998},-9,{"$f":"Data!G579","v":430.71249999999998},{"$f":"Data!L579","v":"SW"},{"$f":"Data!M579","v":0},{"$f":"IF(Data!Q579=\"NOT OPERATIONAL\",\"X\",IF(Data!Q579=\"OPERATIONAL\",\"W\",\"R\"))","v":"X"},{"$f":"Data!N579","v":"DM "}]
[null,{"$f":"Data!K580","v":"WINCANTON"},{"$f":"Data!D580","v":"GB7JB"},{"$f":"Data!F580","v":439.46249999999998},-9,{"$f":"Data!G580","v":430.46249999999998},{"$f":"Data!L580","v":"SW"},{"$f":"Data!M580","v":0},{"$f":"IF(Data!Q580=\"NOT OPERATIONAL\",\"X\",IF(Data!Q580=\"OPERATIONAL\",\"W\",\"R\"))","v":"W"},{"$f":"Data!N580","v":"DM "}]
[null,{"$f":"Data!K581","v":"JEDBURGH"},{"$f":"Data!D581","v":"GB7JD"},{"$f":"Data!F581","v":439.41250000000002},-9,{"$f":"Data!G581","v":430.41250000000002},{"$f":"Data!L581","v":"SCO"},{"$f":"Data!M581","v":0},{"$f":"IF(Data!Q581=\"NOT OPERATIONAL\",\"X\",IF(Data!Q581=\"OPERATIONAL\",\"W\",\"R\"))","v":"W"},{"$f":"Data!N581","v":"DM DS NX "}]
[null,{"$f":"Data!K582","v":"NORTHAMPTON"},{"$f":"Data!D582","v":"GB7JF"},{"$f":"Data!F582","v":439.63749999999999},-9,{"$f":"Data!G582","v":430.63749999999999},{"$f":"Data!L582","v":"MID"},{"$f":"Data!M582","v":0},{"$f":"IF(Data!Q582=\"NOT OPERATIONAL\",\"X\",IF(Data!Q582=\"OPERATIONAL\",\"W\",\"R\"))","v":"W"},{"$f":"Data!N582","v":"DS "}]
[null,{"$f":"Data!K583","v":"ST HELIER"},{"$f":"Data!D583","v":"GB7JI"},{"$f":"Data!F583","v":430.85},7.5999999999999659,{"$f":"Data!G583","v":438.45},{"$f":"Data!L583","v":"SW"},{"$f":"Data!M583","v":0},{"$f":"IF(Data!Q583=\"NOT OPERATIONAL\",\"X\",IF(Data!Q583=\"OPERATIONAL\",\"W\",\"R\"))","v":"W"},{"$f":"Data!N583","v":"DS "}]
[null,{"$f":"Data!K584","v":"ALFORD"},{"$f":"Data!D584","v":"GB7JM"},{"$f":"Data!F584","v":430.88749999999999},7.6000000000000227,{"$f":"Data!G584","v":438.48750000000001},{"$f":"Data!L584","v":"MID"},{"$f":"Data!M584","v":71.900000000000006},{"$f":"IF(Data!Q584=\"NOT OPERATIONAL\",\"X\",IF(Data!Q584=\"OPERATIONAL\",\"W\",\"R\"))","v":"W"},{"$f":"Data!N584","v":"A DM DS FU NX "}]
[null,{"$f":"Data!K585","v":"LEIGHTON BUZZARD"},{"$f":"Data!D585","v":"GB7JT"},{"$f":"Data!F585","v":439.67500000000001},{"$f":"F585-D585","v":-9},{"$f":"Data!G585","v":430.67500000000001},{"$f":"Data!L585","v":"SE"},{"$f":"Data!M585","v":0},{"$f":"IF(Data!Q585=\"NOT OPERATIONAL\",\"X\",IF(Data!Q585=\"OPERATIONAL\",\"W\",\"R\"))","v":"W"},{"$f":"Data!N585","v":"DM FU "}]
[null,{"$f":"Data!K586","v":"HEATHFIELD"},{"$f":"Data!D586","v":"GB7KB"},{"$f":"Data!F586","v":145.65},-0.59999999999999432,{"$f":"Data!G586","v":145.05000000000001},{"$f":"Data!L586","v":"SE"},{"$f":"Data!M586","v":0},{"$f":"IF(Data!Q586=\"NOT OPERATIONAL\",\"X\",IF(Data!Q586=\"OPERATIONAL\",\"W\",\"R\"))","v":"W"},{"$f":"Data!N586","v":"DM "}]
[null,{"$f":"Data!K587","v":"HAILSHAM"},{"$f":"Data!D587","v":"GB7KD"},{"$f":"Data!F587","v":439.6875},-9,{"$f":"Data!G587","v":430.6875},{"$f":"Data!L587","v":"SE"},{"$f":"Data!M587","v":0},{"$f":"IF(Data!Q587=\"NOT OPERATIONAL\",\"X\",IF(Data!Q587=\"OPERATIONAL\",\"W\",\"R\"))","v":"W"},{"$f":"Data!N587","v":"DM "}]
[null,{"$f":"Data!K588","v":"CHATHAM "},{"$f":"Data!D588","v":"GB7KE"},{"$f":"Data!F588","v":430.27499999999998},9,{"$f":"Data!G588","v":439.27499999999998},{"$f":"Data!L588","v":"SE"},{"$f":"Data!M588","v":0},{"$f":"IF(Data!Q588=\"NOT OPERATIONAL\",\"X\",IF(Data!Q588=\"OPERATIONAL\",\"W\",\"R\"))","v":"W"},{"$f":"Data!N588","v":"DS FU "}]
[null,{"$f":"Data!K589","v":"BALLYCASTLE"},{"$f":"Data!D589","v":"GB7KK"},{"$f":"Data!F589","v":430.92500000000001},7.5999999999999659,{"$f":"Data!G589","v":438.52499999999998},{"$f":"Data!L589","v":"NI"},{"$f":"Data!M589","v":0},{"$f":"IF(Data!Q589=\"NOT OPERATIONAL\",\"X\",IF(Data!Q589=\"OPERATIONAL\",\"W\",\"R\"))","v":"W"},{"$f":"Data!N589","v":"DM DS FU "}]
[null,{"$f":"Data!K590","v":"KIRKBY LONSDALE"},{"$f":"Data!D590","v":"GB7KL"},{"$f":"Data!F590","v":430.875},7.6000000000000227,{"$f":"Data!G590","v":438.47500000000002},{"$f":"Data!L590","v":"NOR"},{"$f":"Data!M590","v":110.9},{"$f":"IF(Data!Q590=\"NOT OPERATIONAL\",\"X\",IF(Data!Q590=\"OPERATIONAL\",\"W\",\"R\"))","v":"X"},{"$f":"Data!N590","v":"A FU "}]
[null,{"$f":"Data!K591","v":"EDINBURGH"},{"$f":"Data!D591","v":"GB7KN"},{"$f":"Data!F591","v":439.4375},-9,{"$f":"Data!G591","v":430.4375},{"$f":"Data!L591","v":"SCO"},{"$f":"Data!M591","v":0},{"$f":"IF(Data!Q591=\"NOT OPERATIONAL\",\"X\",IF(Data!Q591=\"OPERATIONAL\",\"W\",\"R\"))","v":"W"},{"$f":"Data!N591","v":"DM DS FU "}]
[null,{"$f":"Data!K592","v":"COMBER"},{"$f":"Data!D592","v":"GB7KP"},{"$f":"Data!F592","v":439.57499999999999},-9,{"$f":"Data!G592","v":430.57499999999999},{"$f":"Data!L592","v":"NI"},{"$f":"Data!M592","v":0},{"$f":"IF(Data!Q592=\"NOT OPERATIONAL\",\"X\",IF(Data!Q592=\"OPERATIONAL\",\"W\",\"R\"))","v":"W"},{"$f":"Data!N592","v":"DM DS FU "}]
[null,{"$f":"Data!K593","v":"KIDDERMINSTER"},{"$f":"Data!D593","v":"GB7KR"},{"$f":"Data!F593","v":430.3},9,{"$f":"Data!G593","v":439.3},{"$f":"Data!L593","v":"MID"},{"$f":"Data!M593","v":0},{"$f":"IF(Data!Q593=\"NOT OPERATIONAL\",\"X\",IF(Data!Q593=\"OPERATIONAL\",\"W\",\"R\"))","v":"W"},{"$f":"Data!N593","v":"DM "}]
[null,{"$f":"Data!K594","v":"STROUD"},{"$f":"Data!D594","v":"GB7KS"},{"$f":"Data!F594","v":430.25},9,{"$f":"Data!G594","v":439.25},{"$f":"Data!L594","v":"SW"},{"$f":"Data!M594","v":0},{"$f":"IF(Data!Q594=\"NOT OPERATIONAL\",\"X\",IF(Data!Q594=\"OPERATIONAL\",\"W\",\"R\"))","v":"X"},{"$f":"Data!N594","v":"DM "}]
[null,{"$f":"Data!K595","v":"ANDOVER"},{"$f":"Data!D595","v":"GB7KT"},{"$f":"Data!F595","v":439.5},-9,{"$f":"Data!G595","v":430.5},{"$f":"Data!L595","v":"SW"},{"$f":"Data!M595","v":0},{"$f":"IF(Data!Q595=\"NOT OPERATIONAL\",\"X\",IF(Data!Q595=\"OPERATIONAL\",\"W\",\"R\"))","v":"W"},{"$f":"Data!N595","v":"DM "}]
[null,{"$f":"Data!K596","v":"BOURNE"},{"$f":"Data!D596","v":"GB7KU"},{"$f":"Data!F596","v":439.52499999999998},-9,{"$f":"Data!G596","v":430.52499999999998},{"$f":"Data!L596","v":"EA"},{"$f":"Data!M596","v":0},{"$f":"IF(Data!Q596=\"NOT OPERATIONAL\",\"X\",IF(Data!Q596=\"OPERATIONAL\",\"W\",\"R\"))","v":"W"},{"$f":"Data!N596","v":"DM DS FU "}]
[null,{"$f":"Data!K597","v":"KIRKCALDY"},{"$f":"Data!D597","v":"GB7KY"},{"$f":"Data!F597","v":439.65},-9,{"$f":"Data!G597","v":430.65},{"$f":"Data!L597","v":"SCO"},{"$f":"Data!M597","v":103.5},{"$f":"IF(Data!Q597=\"NOT OPERATIONAL\",\"X\",IF(Data!Q597=\"OPERATIONAL\",\"W\",\"R\"))","v":"W"},{"$f":"Data!N597","v":"A DM DS FU NX "}]
[null,{"$f":"Data!K598","v":"LANCASTER"},{"$f":"Data!D598","v":"GB7LA"},{"$f":"Data!F598","v":439.36250000000001},-9,{"$f":"Data!G598","v":430.36250000000001},{"$f":"Data!L598","v":"NOR"},{"$f":"Data!M598","v":0},{"$f":"IF(Data!Q598=\"NOT OPERATIONAL\",\"X\",IF(Data!Q598=\"OPERATIONAL\",\"W\",\"R\"))","v":"W"},{"$f":"Data!N598","v":"A DS FU "}]
[null,{"$f":"Data!K599","v":"ALEXANDRIA"},{"$f":"Data!D599","v":"GB7LB"},{"$f":"Data!F599","v":439.33749999999998},-9,{"$f":"Data!G599","v":430.33749999999998},{"$f":"Data!L599","v":"SCO"},{"$f":"Data!M599","v":0},{"$f":"IF(Data!Q599=\"NOT OPERATIONAL\",\"X\",IF(Data!Q599=\"OPERATIONAL\",\"W\",\"R\"))","v":"X"},{"$f":"Data!N599","v":"DM "}]
[null,{"$f":"Data!K600","v":"LINCOLN"},{"$f":"Data!D600","v":"GB7LC"},{"$f":"Data!F600","v":438.38749999999999},-7.5999999999999659,{"$f":"Data!G600","v":430.78750000000002},{"$f":"Data!L600","v":"MID"},{"$f":"Data!M600","v":71.900000000000006},{"$f":"IF(Data!Q600=\"NOT OPERATIONAL\",\"X\",IF(Data!Q600=\"OPERATIONAL\",\"W\",\"R\"))","v":"R"},{"$f":"Data!N600","v":"A DM DS FU NX "}]
[null,{"$f":"Data!K601","v":"LEYLAND"},{"$f":"Data!D601","v":"GB7LD"},{"$f":"Data!F601","v":439.4375},-9,{"$f":"Data!G601","v":430.4375},{"$f":"Data!L601","v":"NOR"},{"$f":"Data!M601","v":0},{"$f":"IF(Data!Q601=\"NOT OPERATIONAL\",\"X\",IF(Data!Q601=\"OPERATIONAL\",\"W\",\"R\"))","v":"W"},{"$f":"Data!N601","v":"DM "}]
[null,{"$f":"Data!K602","v":"LEEDS"},{"$f":"Data!D602","v":"GB7LE"},{"$f":"Data!F602","v":439.66250000000002},-9,{"$f":"Data!G602","v":430.66250000000002},{"$f":"Data!L602","v":"NOR"},{"$f":"Data!M602","v":0},{"$f":"IF(Data!Q602=\"NOT OPERATIONAL\",\"X\",IF(Data!Q602=\"OPERATIONAL\",\"W\",\"R\"))","v":"W"},{"$f":"Data!N602","v":"DM "}]
[null,{"$f":"Data!K603","v":"LANCASTER"},{"$f":"Data!D603","v":"GB7LF"},{"$f":"Data!F603","v":439.53750000000002},-9,{"$f":"Data!G603","v":430.53750000000002},{"$f":"Data!L603","v":"NOR"},{"$f":"Data!M603","v":0},{"$f":"IF(Data!Q603=\"NOT OPERATIONAL\",\"X\",IF(Data!Q603=\"OPERATIONAL\",\"W\",\"R\"))","v":"X"},{"$f":"Data!N603","v":"DS "}]
[null,{"$f":"Data!K604","v":"LISKEARD"},{"$f":"Data!D604","v":"GB7LK"},{"$f":"Data!F604","v":430.8125},7.6000000000000227,{"$f":"Data!G604","v":438.41250000000002},{"$f":"Data!L604","v":"SW"},{"$f":"Data!M604","v":0},{"$f":"IF(Data!Q604=\"NOT OPERATIONAL\",\"X\",IF(Data!Q604=\"OPERATIONAL\",\"W\",\"R\"))","v":"X"},{"$f":"Data!N604","v":"DM "}]
[null,{"$f":"Data!K605","v":"LINCOLN"},{"$f":"Data!D605","v":"GB7LN"},{"$f":"Data!F605","v":439.4},-9,{"$f":"Data!G605","v":430.4},{"$f":"Data!L605","v":"MID"},{"$f":"Data!M605","v":0},{"$f":"IF(Data!Q605=\"NOT OPERATIONAL\",\"X\",IF(Data!Q605=\"OPERATIONAL\",\"W\",\"R\"))","v":"W"},{"$f":"Data!N605","v":"DM "}]
[null,{"$f":"Data!K606","v":"BECKENHAM"},{"$f":"Data!D606","v":"GB7LO"},{"$f":"Data!F606","v":439.51249999999999},-9,{"$f":"Data!G606","v":430.51249999999999},{"$f":"Data!L606","v":"SE"},{"$f":"Data!M606","v":0},{"$f":"IF(Data!Q606=\"NOT OPERATIONAL\",\"X\",IF(Data!Q606=\"OPERATIONAL\",\"W\",\"R\"))","v":"W"},{"$f":"Data!N606","v":"DM "}]
[null,{"$f":"Data!K607","v":"LIVERPOOL"},{"$f":"Data!D607","v":"GB7LP"},{"$f":"Data!F607","v":439.4},-9,{"$f":"Data!G607","v":430.4},{"$f":"Data!L607","v":"NOR"},{"$f":"Data!M607","v":0},{"$f":"IF(Data!Q607=\"NOT OPERATIONAL\",\"X\",IF(Data!Q607=\"OPERATIONAL\",\"W\",\"R\"))","v":"W"},{"$f":"Data!N607","v":"DM "}]
[null,{"$f":"Data!K608","v":"LEICESTER"},{"$f":"Data!D608","v":"GB7LR"},{"$f":"Data!F608","v":439.47500000000002},-9,{"$f":"Data!G608","v":430.47500000000002},{"$f":"Data!L608","v":"MID"},{"$f":"Data!M608","v":0},{"$f":"IF(Data!Q608=\"NOT OPERATIONAL\",\"X\",IF(Data!Q608=\"OPERATIONAL\",\"W\",\"R\"))","v":"W"},{"$f":"Data!N608","v":"DM "}]
[null,{"$f":"Data!K609","v":"GALASHIELS "},{"$f":"Data!D609","v":"GB7LS"},{"$f":"Data!F609","v":439.4},-9,{"$f":"Data!G609","v":430.4},{"$f":"Data!L609","v":"SCO"},{"$f":"Data!M609","v":0},{"$f":"IF(Data!Q609=\"NOT OPERATIONAL\",\"X\",IF(Data!Q609=\"OPERATIONAL\",\"W\",\"R\"))","v":"W"},{"$f":"Data!N609","v":"DM DS FU "}]
[null,{"$f":"Data!K610","v":"BOURNE"},{"$f":"Data!D610","v":"GB7LT"},{"$f":"Data!F610","v":434.05},0,{"$f":"Data!G610","v":434.05},{"$f":"Data!L610","v":"EA"},{"$f":"Data!M610","v":0},{"$f":"IF(Data!Q610=\"NOT OPERATIONAL\",\"X\",IF(Data!Q610=\"OPERATIONAL\",\"W\",\"R\"))","v":"W"},{"$f":"Data!N610","v":""}]
[null,{"$f":"Data!K611","v":"LIVINGSTON"},{"$f":"Data!D611","v":"GB7LV"},{"$f":"Data!F611","v":145.61250000000001},-0.60000000000002274,{"$f":"Data!G611","v":145.01249999999999},{"$f":"Data!L611","v":"SCO"},{"$f":"Data!M611","v":0},{"$f":"IF(Data!Q611=\"NOT OPERATIONAL\",\"X\",IF(Data!Q611=\"OPERATIONAL\",\"W\",\"R\"))","v":"W"},{"$f":"Data!N611","v":"A DM DS FU "}]
[null,{"$f":"Data!K612","v":"LODDISWELL"},{"$f":"Data!D612","v":"GB7LW"},{"$f":"Data!F612","v":145.58750000000001},-0.59999999999999432,{"$f":"Data!G612","v":144.98750000000001},{"$f":"Data!L612","v":"SW"},{"$f":"Data!M612","v":0},{"$f":"IF(Data!Q612=\"NOT OPERATIONAL\",\"X\",IF(Data!Q612=\"OPERATIONAL\",\"W\",\"R\"))","v":"X"},{"$f":"Data!N612","v":"DM "}]
[null,{"$f":"Data!K613","v":"WINKLEIGH"},{"$f":"Data!D613","v":"GB7LZ"},{"$f":"Data!F613","v":430.91250000000002},7.5999999999999659,{"$f":"Data!G613","v":438.51249999999999},{"$f":"Data!L613","v":"SW"},{"$f":"Data!M613","v":0},{"$f":"IF(Data!Q613=\"NOT OPERATIONAL\",\"X\",IF(Data!Q613=\"OPERATIONAL\",\"W\",\"R\"))","v":"W"},{"$f":"Data!N613","v":"DM "}]
[null,{"$f":"Data!K614","v":"MAYBOLE"},{"$f":"Data!D614","v":"GB7MA"},{"$f":"Data!F614","v":439.45},-9,{"$f":"Data!G614","v":430.45},{"$f":"Data!L614","v":"SCO"},{"$f":"Data!M614","v":103.5},{"$f":"IF(Data!Q614=\"NOT OPERATIONAL\",\"X\",IF(Data!Q614=\"OPERATIONAL\",\"W\",\"R\"))","v":"X"},{"$f":"Data!N614","v":"FU "}]
[null,{"$f":"Data!K615","v":"MORECAMBE"},{"$f":"Data!D615","v":"GB7MB"},{"$f":"Data!F615","v":439.7},-9,{"$f":"Data!G615","v":430.7},{"$f":"Data!L615","v":"NOR"},{"$f":"Data!M615","v":0},{"$f":"IF(Data!Q615=\"NOT OPERATIONAL\",\"X\",IF(Data!Q615=\"OPERATIONAL\",\"W\",\"R\"))","v":"W"},{"$f":"Data!N615","v":"FU "}]
[null,{"$f":"Data!K616","v":"ST AUSTELL"},{"$f":"Data!D616","v":"GB7MC"},{"$f":"Data!F616","v":439.53750000000002},-9,{"$f":"Data!G616","v":430.53750000000002},{"$f":"Data!L616","v":"SW"},{"$f":"Data!M616","v":0},{"$f":"IF(Data!Q616=\"NOT OPERATIONAL\",\"X\",IF(Data!Q616=\"OPERATIONAL\",\"W\",\"R\"))","v":"W"},{"$f":"Data!N616","v":"DS FU "}]
[null,{"$f":"Data!K617","v":"BLANDFORD FORUM"},{"$f":"Data!D617","v":"GB7MD"},{"$f":"Data!F617","v":439.4},-9,{"$f":"Data!G617","v":430.4},{"$f":"Data!L617","v":"SW"},{"$f":"Data!M617","v":0},{"$f":"IF(Data!Q617=\"NOT OPERATIONAL\",\"X\",IF(Data!Q617=\"OPERATIONAL\",\"W\",\"R\"))","v":"W"},{"$f":"Data!N617","v":"FU "}]
[null,{"$f":"Data!K618","v":"RUGBY"},{"$f":"Data!D618","v":"GB7ME"},{"$f":"Data!F618","v":439.72500000000002},-9,{"$f":"Data!G618","v":430.72500000000002},{"$f":"Data!L618","v":"MID"},{"$f":"Data!M618","v":0},{"$f":"IF(Data!Q618=\"NOT OPERATIONAL\",\"X\",IF(Data!Q618=\"OPERATIONAL\",\"W\",\"R\"))","v":"W"},{"$f":"Data!N618","v":"DS "}]
[null,{"$f":"Data!K619","v":"MAGHERAFELT"},{"$f":"Data!D619","v":"GB7MF"},{"$f":"Data!F619","v":439.67500000000001},-9,{"$f":"Data!G619","v":430.67500000000001},{"$f":"Data!L619","v":"NI"},{"$f":"Data!M619","v":0},{"$f":"IF(Data!Q619=\"NOT OPERATIONAL\",\"X\",IF(Data!Q619=\"OPERATIONAL\",\"W\",\"R\"))","v":"W"},{"$f":"Data!N619","v":"DM DS FU "}]
[null,{"$f":"Data!K620","v":"EAST GRINSTEAD"},{"$f":"Data!D620","v":"GB7MH"},{"$f":"Data!F620","v":439.63749999999999},-9,{"$f":"Data!G620","v":430.63749999999999},{"$f":"Data!L620","v":"SE"},{"$f":"Data!M620","v":0},{"$f":"IF(Data!Q620=\"NOT OPERATIONAL\",\"X\",IF(Data!Q620=\"OPERATIONAL\",\"W\",\"R\"))","v":"W"},{"$f":"Data!N620","v":"DM DS FU "}]
[null,{"$f":"Data!K621","v":"ROMSEY"},{"$f":"Data!D621","v":"GB7MJ"},{"$f":"Data!F621","v":439.63749999999999},-9,{"$f":"Data!G621","v":430.63749999999999},{"$f":"Data!L621","v":"SW"},{"$f":"Data!M621","v":0},{"$f":"IF(Data!Q621=\"NOT OPERATIONAL\",\"X\",IF(Data!Q621=\"OPERATIONAL\",\"W\",\"R\"))","v":"W"},{"$f":"Data!N621","v":"DM "}]
[null,{"$f":"Data!K622","v":"IPSWICH"},{"$f":"Data!D622","v":"GB7MK"},{"$f":"Data!F622","v":439.6},-9,{"$f":"Data!G622","v":430.6},{"$f":"Data!L622","v":"EA"},{"$f":"Data!M622","v":0},{"$f":"IF(Data!Q622=\"NOT OPERATIONAL\",\"X\",IF(Data!Q622=\"OPERATIONAL\",\"W\",\"R\"))","v":"W"},{"$f":"Data!N622","v":"DM "}]
[null,{"$f":"Data!K623","v":"NAIRN"},{"$f":"Data!D623","v":"GB7MM"},{"$f":"Data!F623","v":439.75},-9,{"$f":"Data!G623","v":430.75},{"$f":"Data!L623","v":"SCO"},{"$f":"Data!M623","v":0},{"$f":"IF(Data!Q623=\"NOT OPERATIONAL\",\"X\",IF(Data!Q623=\"OPERATIONAL\",\"W\",\"R\"))","v":"W"},{"$f":"Data!N623","v":"DM DS FU "}]
[null,{"$f":"Data!K624","v":"STOCKPORT"},{"$f":"Data!D624","v":"GB7MN"},{"$f":"Data!F624","v":439.41250000000002},-9,{"$f":"Data!G624","v":430.41250000000002},{"$f":"Data!L624","v":"NOR"},{"$f":"Data!M624","v":0},{"$f":"IF(Data!Q624=\"NOT OPERATIONAL\",\"X\",IF(Data!Q624=\"OPERATIONAL\",\"W\",\"R\"))","v":"W"},{"$f":"Data!N624","v":"DM "}]
[null,{"$f":"Data!K625","v":"HEYSHAM"},{"$f":"Data!D625","v":"GB7MP"},{"$f":"Data!F625","v":439.75},-9,{"$f":"Data!G625","v":430.75},{"$f":"Data!L625","v":"NOR"},{"$f":"Data!M625","v":0},{"$f":"IF(Data!Q625=\"NOT OPERATIONAL\",\"X\",IF(Data!Q625=\"OPERATIONAL\",\"W\",\"R\"))","v":"W"},{"$f":"Data!N625","v":"DM "}]
[null,{"$f":"Data!K626","v":"BURY"},{"$f":"Data!D626","v":"GB7MR"},{"$f":"Data!F626","v":439.73750000000001},-9,{"$f":"Data!G626","v":430.73750000000001},{"$f":"Data!L626","v":"NOR"},{"$f":"Data!M626","v":0},{"$f":"IF(Data!Q626=\"NOT OPERATIONAL\",\"X\",IF(Data!Q626=\"OPERATIONAL\",\"W\",\"R\"))","v":"W"},{"$f":"Data!N626","v":"DM "}]
[null,{"$f":"Data!K627","v":"NEWCASTLE UPON TYNE"},{"$f":"Data!D627","v":"GB7MS"},{"$f":"Data!F627","v":145.77500000000001},-0.59999999999999432,{"$f":"Data!G627","v":145.17500000000001},{"$f":"Data!L627","v":"NOR"},{"$f":"Data!M627","v":0},{"$f":"IF(Data!Q627=\"NOT OPERATIONAL\",\"X\",IF(Data!Q627=\"OPERATIONAL\",\"W\",\"R\"))","v":"W"},{"$f":"Data!N627","v":"DM "}]
[null,{"$f":"Data!K628","v":"SOUTHAMPTON"},{"$f":"Data!D628","v":"GB7MT"},{"$f":"Data!F628","v":439.66250000000002},-9,{"$f":"Data!G628","v":430.66250000000002},{"$f":"Data!L628","v":"SW"},{"$f":"Data!M628","v":0},{"$f":"IF(Data!Q628=\"NOT OPERATIONAL\",\"X\",IF(Data!Q628=\"OPERATIONAL\",\"W\",\"R\"))","v":"W"},{"$f":"Data!N628","v":"FU "}]
[null,{"$f":"Data!K629","v":"BARNSLEY"},{"$f":"Data!D629","v":"GB7NA-B"},{"$f":"Data!F629","v":439.45},-9,{"$f":"Data!G629","v":430.45},{"$f":"Data!L629","v":"NOR"},{"$f":"Data!M629","v":71.900000000000006},{"$f":"IF(Data!Q629=\"NOT OPERATIONAL\",\"X\",IF(Data!Q629=\"OPERATIONAL\",\"W\",\"R\"))","v":"W"},{"$f":"Data!N629","v":"A DS "}]
[null,{"$f":"Data!K630","v":"BARNSLEY"},{"$f":"Data!D630","v":"GB7NA-C"},{"$f":"Data!F630","v":145.67500000000001},-0.60000000000002274,{"$f":"Data!G630","v":145.07499999999999},{"$f":"Data!L630","v":"NOR"},{"$f":"Data!M630","v":0},{"$f":"IF(Data!Q630=\"NOT OPERATIONAL\",\"X\",IF(Data!Q630=\"OPERATIONAL\",\"W\",\"R\"))","v":"W"},{"$f":"Data!N630","v":"A DS "}]
[null,{"$f":"Data!K631","v":"BARNSLEY"},{"$f":"Data!D631","v":"GB7NA-P"},{"$f":"Data!F631","v":439.45},-9,{"$f":"Data!G631","v":430.45},{"$f":"Data!L631","v":"NOR"},{"$f":"Data!M631","v":71.900000000000006},{"$f":"IF(Data!Q631=\"NOT OPERATIONAL\",\"X\",IF(Data!Q631=\"OPERATIONAL\",\"W\",\"R\"))","v":"W"},{"$f":"Data!N631","v":"A "}]
[null,{"$f":"Data!K632","v":"NORWICH"},{"$f":"Data!D632","v":"GB7NB"},{"$f":"Data!F632","v":439.6875},-9,{"$f":"Data!G632","v":430.6875},{"$f":"Data!L632","v":"EA"},{"$f":"Data!M632","v":0},{"$f":"IF(Data!Q632=\"NOT OPERATIONAL\",\"X\",IF(Data!Q632=\"OPERATIONAL\",\"W\",\"R\"))","v":"W"},{"$f":"Data!N632","v":"DS "}]
[null,{"$f":"Data!K633","v":"GREAT ELLINGHAM"},{"$f":"Data!D633","v":"GB7ND"},{"$f":"Data!F633","v":439.41250000000002},-9,{"$f":"Data!G633","v":430.41250000000002},{"$f":"Data!L633","v":"EA"},{"$f":"Data!M633","v":0},{"$f":"IF(Data!Q633=\"NOT OPERATIONAL\",\"X\",IF(Data!Q633=\"OPERATIONAL\",\"W\",\"R\"))","v":"W"},{"$f":"Data!N633","v":"DM "}]
[null,{"$f":"Data!K634","v":"ELLINGTON  MORPETH"},{"$f":"Data!D634","v":"GB7NE"},{"$f":"Data!F634","v":439.45},-9,{"$f":"Data!G634","v":430.45},{"$f":"Data!L634","v":"NOR"},{"$f":"Data!M634","v":0},{"$f":"IF(Data!Q634=\"NOT OPERATIONAL\",\"X\",IF(Data!Q634=\"OPERATIONAL\",\"W\",\"R\"))","v":"W"},{"$f":"Data!N634","v":"DM DS FU "}]
[null,{"$f":"Data!K635","v":"NEWHAVEN"},{"$f":"Data!D635","v":"GB7NF"},{"$f":"Data!F635","v":439.48750000000001},-9,{"$f":"Data!G635","v":430.48750000000001},{"$f":"Data!L635","v":"SE"},{"$f":"Data!M635","v":0},{"$f":"IF(Data!Q635=\"NOT OPERATIONAL\",\"X\",IF(Data!Q635=\"OPERATIONAL\",\"W\",\"R\"))","v":"W"},{"$f":"Data!N635","v":"DM "}]
[null,{"$f":"Data!K636","v":"ALDERSHOT"},{"$f":"Data!D636","v":"GB7NH"},{"$f":"Data!F636","v":439.625},-9,{"$f":"Data!G636","v":430.625},{"$f":"Data!L636","v":"SW"},{"$f":"Data!M636","v":0},{"$f":"IF(Data!Q636=\"NOT OPERATIONAL\",\"X\",IF(Data!Q636=\"OPERATIONAL\",\"W\",\"R\"))","v":"W"},{"$f":"Data!N636","v":"FU "}]
[null,{"$f":"Data!K637","v":"NORTHAMPTON"},{"$f":"Data!D637","v":"GB7NI"},{"$f":"Data!F637","v":430.98750000000001},7.5999999999999659,{"$f":"Data!G637","v":438.58749999999998},{"$f":"Data!L637","v":"MID"},{"$f":"Data!M637","v":77},{"$f":"IF(Data!Q637=\"NOT OPERATIONAL\",\"X\",IF(Data!Q637=\"OPERATIONAL\",\"W\",\"R\"))","v":"W"},{"$f":"Data!N637","v":"A FU "}]
[null,{"$f":"Data!K638","v":"EXETER"},{"$f":"Data!D638","v":"GB7NL"},{"$f":"Data!F638","v":439.46249999999998},-9,{"$f":"Data!G638","v":430.46249999999998},{"$f":"Data!L638","v":"SW"},{"$f":"Data!M638","v":0},{"$f":"IF(Data!Q638=\"NOT OPERATIONAL\",\"X\",IF(Data!Q638=\"OPERATIONAL\",\"W\",\"R\"))","v":"W"},{"$f":"Data!N638","v":"DS "}]
[null,{"$f":"Data!K639","v":"ATTLEBOURGH"},{"$f":"Data!D639","v":"GB7NM"},{"$f":"Data!F639","v":145.73750000000001},-0.60000000000002274,{"$f":"Data!G639","v":145.13749999999999},{"$f":"Data!L639","v":"EA"},{"$f":"Data!M639","v":0},{"$f":"IF(Data!Q639=\"NOT OPERATIONAL\",\"X\",IF(Data!Q639=\"OPERATIONAL\",\"W\",\"R\"))","v":"W"},{"$f":"Data!N639","v":"DS FU "}]
[null,{"$f":"Data!K640","v":"WORKSOP"},{"$f":"Data!D640","v":"GB7NN"},{"$f":"Data!F640","v":439.75},-9,{"$f":"Data!G640","v":430.75},{"$f":"Data!L640","v":"MID"},{"$f":"Data!M640","v":0},{"$f":"IF(Data!Q640=\"NOT OPERATIONAL\",\"X\",IF(Data!Q640=\"OPERATIONAL\",\"W\",\"R\"))","v":"W"},{"$f":"Data!N640","v":"FU "}]
[null,{"$f":"Data!K641","v":"NOTTINGHAM"},{"$f":"Data!D641","v":"GB7NR"},{"$f":"Data!F641","v":439.4375},-9,{"$f":"Data!G641","v":430.4375},{"$f":"Data!L641","v":"MID"},{"$f":"Data!M641","v":0},{"$f":"IF(Data!Q641=\"NOT OPERATIONAL\",\"X\",IF(Data!Q641=\"OPERATIONAL\",\"W\",\"R\"))","v":"W"},{"$f":"Data!N641","v":"DM DS "}]
[null,{"$f":"Data!K642","v":"BANSTEAD  SURREY"},{"$f":"Data!D642","v":"GB7NS"},{"$f":"Data!F642","v":439.16250000000002},-9,{"$f":"Data!G642","v":430.16250000000002},{"$f":"Data!L642","v":"SE"},{"$f":"Data!M642","v":0},{"$f":"IF(Data!Q642=\"NOT OPERATIONAL\",\"X\",IF(Data!Q642=\"OPERATIONAL\",\"W\",\"R\"))","v":"W"},{"$f":"Data!N642","v":"DM "}]
[null,{"$f":"Data!K643","v":"NEWBURY"},{"$f":"Data!D643","v":"GB7NT"},{"$f":"Data!F643","v":430.92500000000001},7.5999999999999659,{"$f":"Data!G643","v":438.52499999999998},{"$f":"Data!L643","v":"SW"},{"$f":"Data!M643","v":118.8},{"$f":"IF(Data!Q643=\"NOT OPERATIONAL\",\"X\",IF(Data!Q643=\"OPERATIONAL\",\"W\",\"R\"))","v":"W"},{"$f":"Data!N643","v":"A FU "}]
[null,{"$f":"Data!K644","v":"NOTTINGHAM"},{"$f":"Data!D644","v":"GB7NV"},{"$f":"Data!F644","v":430.82499999999999},7.6000000000000227,{"$f":"Data!G644","v":438.42500000000001},{"$f":"Data!L644","v":"MID"},{"$f":"Data!M644","v":0},{"$f":"IF(Data!Q644=\"NOT OPERATIONAL\",\"X\",IF(Data!Q644=\"OPERATIONAL\",\"W\",\"R\"))","v":"W"},{"$f":"Data!N644","v":"DM DS "}]
[null,{"$f":"Data!K645","v":"SWINDON"},{"$f":"Data!D645","v":"GB7NW"},{"$f":"Data!F645","v":439.72500000000002},-9,{"$f":"Data!G645","v":430.72500000000002},{"$f":"Data!L645","v":"SW"},{"$f":"Data!M645","v":0},{"$f":"IF(Data!Q645=\"NOT OPERATIONAL\",\"X\",IF(Data!Q645=\"OPERATIONAL\",\"W\",\"R\"))","v":"W"},{"$f":"Data!N645","v":"FU "}]
[null,{"$f":"Data!K646","v":"NEAR HOLSWORTHY "},{"$f":"Data!D646","v":"GB7NX"},{"$f":"Data!F646","v":438.38749999999999},-7.5999999999999659,{"$f":"Data!G646","v":430.78750000000002},{"$f":"Data!L646","v":"SW"},{"$f":"Data!M646","v":77},{"$f":"IF(Data!Q646=\"NOT OPERATIONAL\",\"X\",IF(Data!Q646=\"OPERATIONAL\",\"W\",\"R\"))","v":"W"},{"$f":"Data!N646","v":"A DM DS FU "}]
[null,{"$f":"Data!K647","v":"BECKENHAM"},{"$f":"Data!D647","v":"GB7OK"},{"$f":"Data!F647","v":145.71250000000001},-0.59999999999999432,{"$f":"Data!G647","v":145.11250000000001},{"$f":"Data!L647","v":"SE"},{"$f":"Data!M647","v":0},{"$f":"IF(Data!Q647=\"NOT OPERATIONAL\",\"X\",IF(Data!Q647=\"OPERATIONAL\",\"W\",\"R\"))","v":"W"},{"$f":"Data!N647","v":"DM DS FU "}]
[null,{"$f":"Data!K648","v":"KIRKWALL"},{"$f":"Data!D648","v":"GB7OR"},{"$f":"Data!F648","v":439.46249999999998},-9,{"$f":"Data!G648","v":430.46249999999998},{"$f":"Data!L648","v":"SCO"},{"$f":"Data!M648","v":77},{"$f":"IF(Data!Q648=\"NOT OPERATIONAL\",\"X\",IF(Data!Q648=\"OPERATIONAL\",\"W\",\"R\"))","v":"W"},{"$f":"Data!N648","v":"A DM "}]
[null,{"$f":"Data!K649","v":"PAISLEY"},{"$f":"Data!D649","v":"GB7PA"},{"$f":"Data!F649","v":439.52499999999998},{"$f":"F649-D649","v":-9},{"$f":"Data!G649","v":430.52499999999998},{"$f":"Data!L649","v":"SCO"},{"$f":"Data!M649","v":0},{"$f":"IF(Data!Q649=\"NOT OPERATIONAL\",\"X\",IF(Data!Q649=\"OPERATIONAL\",\"W\",\"R\"))","v":"W"},{"$f":"Data!N649","v":"DM "}]
[null,{"$f":"Data!K650","v":"DURHAM"},{"$f":"Data!D650","v":"GB7PB"},{"$f":"Data!F650","v":145.66249999999999},-0.59999999999999432,{"$f":"Data!G650","v":145.0625},{"$f":"Data!L650","v":"NOR"},{"$f":"Data!M650","v":0},{"$f":"IF(Data!Q650=\"NOT OPERATIONAL\",\"X\",IF(Data!Q650=\"OPERATIONAL\",\"W\",\"R\"))","v":"W"},{"$f":"Data!N650","v":"DS "}]
[null,{"$f":"Data!K651","v":"MULLION"},{"$f":"Data!D651","v":"GB7PC"},{"$f":"Data!F651","v":145.6},-0.59999999999999432,{"$f":"Data!G651","v":145},{"$f":"Data!L651","v":"SW"},{"$f":"Data!M651","v":0},{"$f":"IF(Data!Q651=\"NOT OPERATIONAL\",\"X\",IF(Data!Q651=\"OPERATIONAL\",\"W\",\"R\"))","v":"W"},{"$f":"Data!N651","v":"DM "}]
[null,{"$f":"Data!K652","v":"PETERBOROUGH"},{"$f":"Data!D652","v":"GB7PE"},{"$f":"Data!F652","v":439.5},-9,{"$f":"Data!G652","v":430.5},{"$f":"Data!L652","v":"EA"},{"$f":"Data!M652","v":0},{"$f":"IF(Data!Q652=\"NOT OPERATIONAL\",\"X\",IF(Data!Q652=\"OPERATIONAL\",\"W\",\"R\"))","v":"W"},{"$f":"Data!N652","v":"DM "}]
[null,{"$f":"Data!K653","v":"PRINCETOWN"},{"$f":"Data!D653","v":"GB7PF"},{"$f":"Data!F653","v":439.63749999999999},-9,{"$f":"Data!G653","v":430.63749999999999},{"$f":"Data!L653","v":"SW"},{"$f":"Data!M653","v":0},{"$f":"IF(Data!Q653=\"NOT OPERATIONAL\",\"X\",IF(Data!Q653=\"OPERATIONAL\",\"W\",\"R\"))","v":"W"},{"$f":"Data!N653","v":"DM "}]
[null,{"$f":"Data!K654","v":"HAILSHAM"},{"$f":"Data!D654","v":"GB7PH"},{"$f":"Data!F654","v":439.46249999999998},-9,{"$f":"Data!G654","v":430.46249999999998},{"$f":"Data!L654","v":"SE"},{"$f":"Data!M654","v":0},{"$f":"IF(Data!Q654=\"NOT OPERATIONAL\",\"X\",IF(Data!Q654=\"OPERATIONAL\",\"W\",\"R\"))","v":"W"},{"$f":"Data!N654","v":"DM DS "}]
[null,{"$f":"Data!K656","v":"CHARTERHOUSE"},{"$f":"Data!D655","v":"GB7PI"},{"$f":"Data!F656","v":439.4375},-9,{"$f":"Data!G656","v":430.4375},{"$f":"Data!L656","v":"SW"},{"$f":"Data!M656","v":0},{"$f":"IF(Data!Q656=\"NOT OPERATIONAL\",\"X\",IF(Data!Q656=\"OPERATIONAL\",\"W\",\"R\"))","v":"X"},{"$f":"Data!N656","v":"FU "}]
[null,null,{"$f":"Data!D656","v":"GB7PM"},0,null,null,0]

{"sheet":"Data","index":1,"n_rows":808,"n_cols":17,"rows_kept":808,"cut":false,"hidden":false,"merged":[[1,3,2,13]]}
[]
[null,null,null,"The Data In This Table  Can Be Updated From UK Repeaters Via The Internet"]
[]
[]
[]
[]
[]
[null,null,null,"Column1","[CHAN]","[OUTPUT]","[RX]","[QTHR]","[km]","[deg]","[WHERE]","[REG]","[CTCSS/CC]","_1","WWW","[KEEPER]","_2"]
[null,null,null,"2E0BJL","DVU-R21",430.26249999999999,439.26249999999999,"IO91UI",null,null,"EPSOM","SE",null,"FU ",null,null,"NOT OPERATIONAL"]
[null,null,null,"2E0HOQ","DVU44",439.55,430.55,"IO81",null,null,"WESTON SUPER MARE","SW",null,"",null,null,"NOT OPERATIONAL"]
[null,null,null,"2E0LNX","DVU35",439.4375,430.4375,"IO90KT",null,null,"GOSPORT","SW",null,"DM FU ",null,null,"OPERATIONAL"]
[null,null,null,"2E0PEU","RV46",145.57499999999999,144.97499999999999,"IO83",null,null,"STOKE-ON-TRENT","MID",103.5,"A ",null,null,"OPERATIONAL"]
[null,null,null,"2M0FPI","DVU12",439.15,430.15,"IO87WC",null,null,"ABERDEEN","SCO",null,"DS FU ",null,null,"OPERATIONAL"]
[null,null,null,"2M0SBP","DVU56",439.7,430.7,"IO76BV",null,null,"ARISAIG","SCO",null,"DM DS FU NX ",null,null,"NOT OPERATIONAL"]
[null,null,null,"G1TTR","RBW24",433.3,438.3,"IO92",null,null,"ERDINGTON","MID",67,"A DM ",null,null,"OPERATIONAL"]
[null,null,null,"G1YFF","RB08",433.2,434.8,"JO02",null,null,"HAVERHILL","EA",210.7,"A ",null,null,"OPERATIONAL"]
[null,null,null,"G3PWJ","RBW21",433.26249999999999,438.26249999999999,"IO82WK",null,null,"STOURBRIDGE","MID",67,"A DM ",null,null,"NOT OPERATIONAL"]
[null,null,null,"G4IPE","RU73",430.91250000000002,438.51249999999999,"IO93PP",null,null,"SCUNTHORPE","MID",77,"A ",null,null,"OPERATIONAL"]
[null,null,null,"G4NAB","RU72",430.9,438.5,"IO95",null,null,"ASHINGTON","NOR",118.8,"A ",null,null,"OPERATIONAL"]
[null,null,null,"G4RKY","UR63",438.38749999999999,430.78750000000002,"IO81",null,null,"SHIPHAM","SW",77,"A ",null,null,"NOT OPERATIONAL"]
[null,null,null,"G4VZO","RBW20",433.25,438.25,"IO82",null,null,"KINGSWINFORD","MID",123,"A DM NX ",null,null,"OPERATIONAL"]
[null,null,null,"G5BSD","RU78",430.97500000000002,438.57499999999999,"IO91WF",null,null,"SURREY","SE",82.5,"A ",null,null,"OPERATIONAL"]
[null,null,null,"G8YDE","DVU46",439.57499999999999,430.57499999999999,"IO91",null,null,"CHESHAM","SE",null,"DM ",null,null,"OPERATIONAL"]
[null,null,null,"GB3AA","RV53",145.66249999999999,145.0625,"IO81RO",null,null,"BRISTOL","SW",94.8,"A ",null,null,"OPERATIONAL"]
[null,null,null,"GB3AB","RB15",433.375,434.97500000000002,"IO93FK",null,null,"SHEFFIELD","NOR",82.5,"A ",null,null,"OPERATIONAL"]
[null,null,null,"GB3AC","RU78",430.97500000000002,438.57499999999999,"IO81RL",null,null,"BRISTOL","SW",94.8,"A ",null,null,"OPERATIONAL"]
[null,null,null,"GB3AD","UR63",438.38749999999999,430.78750000000002,"IO85",null,null,"HAWICK","SCO",118.8,"A ",null,null,"NOT OPERATIONAL"]
[null,null,null,"GB3AG","RV58",145.72499999999999,145.125,"IO86ON",null,null,"ANGUS","SCO",94.8,"A FU ",null,null,"OPERATIONAL"]
[null,null,null,"GB3AH","RB11",433.27499999999998,434.875,"JO02KP",null,null,"EAST DEREHAM","EA",94.8,"A ",null,null,"OPERATIONAL"]
[null,null,null,"GB3AL","RV59",145.73750000000001,145.13749999999999,"IO91QP",null,null,"AMERSHAM","SE",77,"A ",null,null,"OPERATIONAL"]
[null,null,null,"GB3AM","R50-13",50.84,51.34,"IO91QP",null,null,"AMERSHAM","SE",77,"A ",null,null,"OPERATIONAL"]
[null,null,null,"GB3AN","RB08",433.2,434.8,"IO73UJ",null,null,"AMLWCH","WM",110.9,"A FU ",null,null,"OPERATIONAL"]
[null,null,null,"GB3AR","RV56",145.69999999999999,145.1,"IO73VC",null,null,"CAERNARFON","WM",110.9,"A FU ",null,null,"OPERATIONAL"]
[null,null,null,"GB3AS","RV48",145.6,145,"IO85MC",null,null,"LANGHOLM","SCO",77,"A ",null,null,"OPERATIONAL"]
[null,null,null,"GB3AU","RB07",433.17500000000001,434.77499999999998,"IO91QP",null,null,"AMERSHAM","SE",82.5,"A ",null,null,"OPERATIONAL"]
[null,null,null,"GB3AV","RB02",433.05,434.65,"IO91OT",null,null,"AYLESBURY","SE",118.8,"A ",null,null,"OPERATIONAL"]
[null,null,null,"GB3AW","RB10",433.25,434.85,"IO91GH",null,null,"NEWBURY","SW",71.900000000000006,"A ",null,null,"OPERATIONAL"]
[null,null,null,"GB3AY","RV52",145.65,145.05000000000001,"IO75OR",null,null,"DALRY","SCO",103.5,"A ",null,null,"NOT OPERATIONAL"]
[null,null,null,"GB3BA","RBW26",433.32499999999999,438.32499999999999,"IO91",null,null,"BASINGSTOKE","SW",71.900000000000006,"A ",null,null,"OPERATIONAL"]
[null,null,null,"GB3BB","RV56",145.69999999999999,145.1,"IO81",null,null,"BRECON","WM",94.8,"A ",null,null,"OPERATIONAL"]
[null,null,null,"GB3BC","RV60",145.75,145.15,"IO81IO",null,null,"PONTYPRIDD","WM",94.8,"A ",null,null,"OPERATIONAL"]
[null,null,null,"GB3BD","RU65",430.8125,438.41250000000002,"IO92IB",null,null,"BANBURY","SW",71.900000000000006,"A ",null,null,"OPERATIONAL"]
[null,null,null,"GB3BE","RU69",430.86250000000001,438.46249999999998,"IO85",null,null,"DUNS","SCO",118.8,"A FU "]
[null,null,null,"GB3BF","RV63",145.78749999999999,145.1875,"IO92SD",null,null,"BEDFORD","SE",77,"A ",null,null,"OPERATIONAL"]
[null,null,null,"GB3BG","RV60",145.75,145.15,"IO80",null,null,"CHULMLEIGH","SW",118.8,"A DM ",null,null,"OPERATIONAL"]
[null,null,null,"GB3BH","RU79",430.98750000000001,438.58749999999998,"JO00FU",null,null,"BEXHILL-ON-SEA","SE",77,"A DM ",null,null,"OPERATIONAL"]
[null,null,null,"GB3BI","RV58",145.72499999999999,145.125,"IO77RM",null,null,"MUIR OF ORD","SCO",67,"A ",null,null,"OPERATIONAL"]
[null,null,null,"GB3BK","RU72",430.9,438.5,"JO01AK",null,null,"BROMLEY","SE",103.5,"A ",null,null,"OPERATIONAL"]
[null,null,null,"GB3BL","RU70",430.875,438.47500000000002,"IO92SD",null,null,"BEDFORD","SE",77,"A ",null,null,"OPERATIONAL"]
[null,null,null,"GB3BM","RV57",145.71250000000001,145.11250000000001,"IO82",null,null,"DUDLEY","MID",67,"A ",null,null,"OPERATIONAL"]
[null,null,null,"GB3BM-2","RV57",145.71250000000001,145.11250000000001,"IO92",null,null,"BIRMINGHAM","MID",67,"A ",null,null,"OPERATIONAL"]
[null,null,null,"GB3BN","RB0",433,434.6,"IO91OJ",null,null,"BRACKNELL","SW",118.8,"A ",null,null,"OPERATIONAL"]
[null,null,null,"GB3BP","RU77",430.96249999999998,438.5625,"IO91SR",null,null,"HEMEL HEMPSTEAD ","SE",82.5,"A ",null,null,"OPERATIONAL"]
[null,null,null,"GB3BR","RU65",430.8125,438.41250000000002,"IO90",null,null,"HOVE","SE",88.5,"A ",null,null,"OPERATIONAL"]
[null,null,null,"GB3BS","RU68",430.85,438.45,"IO81TK",null,null,"BRISTOL","SW",118.8,"A ",null,null,"OPERATIONAL"]
[null,null,null,"GB3BT","RV56",145.69999999999999,145.1,"IO85WT",null,null,"BERWICK ON TWEED","SCO",118.8,"A DM FU ",null,null,"OPERATIONAL"]
[null,null,null,"GB3BU","RU77",430.96249999999998,438.5625,"IO70",null,null,"BUDE","SW",77,"DM ",null,null,"OPERATIONAL"]
[null,null,null,"GB3BV","RB01",433.02499999999998,434.625,"IO91SR",null,null,"HEMEL HEMPSTEAD","SE",82.5,"A FU ",null,null,"OPERATIONAL"]
[null,null,null,"GB3BW","RU65",430.8125,438.41250000000002,"IO93HO",null,null,"WAKEFIELD","NOR",107.2,"A ",null,null,"OPERATIONAL"]
[null,null,null,"GB3BX","RV54",145.67500000000001,145.07499999999999,"IO82",null,null,"CLEOBURY NORTH","MID",null,"DM ",null,null,"REDUCED OUTPUT"]
[null,null,null,"GB3BY","RU78",430.97500000000002,438.57499999999999,"IO83QP",null,null,"CHORLEY","NOR",82.5,"A ",null,null,"OPERATIONAL"]
[null,null,null,"GB3BZ","RU68",430.85,438.45,"JO01GW",null,null,"BRAINTREE","EA",110.9,"A DM ",null,null,"OPERATIONAL"]
[null,null,null,"GB3CA","RB13",433.32499999999999,434.92500000000001,"IO84OT",null,null,"CARLISLE","NOR",77,"A ",null,null,"OPERATIONAL"]
[null,null,null,"GB3CB","RB14",433.35,434.95,"IO92BL",null,null,"BIRMINGHAM","MID",67,"A ",null,null,"OPERATIONAL"]
[null,null,null,"GB3CC","RU77",430.96249999999998,438.5625,"IO90",null,null,"CHICHESTER","SE",88.5,"A ",null,null,"OPERATIONAL"]
[null,null,null,"GB3CD","RV55",145.6875,145.08750000000001,"IO94DR",null,null,"CROOK","NOR",118.8,"A FU ",null,null,"OPERATIONAL"]
[null,null,null,"GB3CE","RB14",433.35,434.95,"JO01KV",null,null,"COLCHESTER","EA",67,"A ",null,null,"OPERATIONAL"]
[null,null,null,"GB3CF","RV48",145.6,145,"IO92IQ",null,null,"MARKFIELD","MID",77,"A DS FU NX ",null,null,"OPERATIONAL"]
[null,null,null,"GB3CG","RV58",145.72499999999999,145.125,"IO81VU",null,null,"GLOUCESTER","SW",118.8,"A ",null,null,"OPERATIONAL"]
[null,null,null,"GB3CH","RU70",430.875,438.47500000000002,"IO70SM",null,null,"LISKEARD","SW",77,"A ",null,null,"NOT OPERATIONAL"]
[null,null,null,"GB3CI","RU66",430.82499999999999,438.42500000000001,"IO92PM",null,null,"CORBY","MID",77,"A ",null,null,"OPERATIONAL"]
[null,null,null,"GB3CJ",null,29.64,29.54,"IO92QF",null,null,"BOZEAT","MID",77,"A ",null,null,"NOT OPERATIONAL"]
[null,null,null,"GB3CK","RB0",433,434.6,"JO01JF",null,null,"CHARING KENT","SE",103.5,"A ",null,null,"NOT OPERATIONAL"]
[null,null,null,"GB3CL","RB09",433.22500000000002,434.82499999999999,"JO01OT",null,null,"CLACTON","EA",67,"A ",null,null,"OPERATIONAL"]
[null,null,null,"GB3CM","RU69",430.86250000000001,438.46249999999998,"IO71VW",null,null,"CARMARTHEN","WM",94.8,"A FU ",null,null,"OPERATIONAL"]
[null,null,null,"GB3CN","RV55",145.6875,145.08750000000001,"IO71TX",null,null,"NEWCASTLE EMLYN","WM",94.8,"A ",null,null,"OPERATIONAL"]
[null,null,null,"GB3CO","RV53",145.66249999999999,145.0625,"IO92QM",null,null,"CORBY","MID",77,"A ",null,null,"NOT OPERATIONAL"]
[null,null,null,"GB3CP","RV59",145.73750000000001,145.13749999999999,"IO64FI",null,null,"FERMANAGH","NI",110.9,"A ",null,null,"OPERATIONAL"]
[null,null,null,"GB3CQ",null,29.63,29.53,"IO90",null,null,"WORTHING","SE",88.5,"A ",null,null,"OPERATIONAL"]
[null,null,null,"GB3CR","RB06",433.15,434.75,"IO83",null,null,"CAERGWRLE","WM",110.9,"A ",null,null,"OPERATIONAL"]
[null,null,null,"GB3CS","RV60",145.75,145.15,"IO85",null,null,"MOTHERWELL","SCO",103.5,"A ",null,null,"OPERATIONAL"]
[null,null,null,"GB3CU","UR63",438.38749999999999,430.78750000000002,"IO84GQ",null,null,"MARYPORT","NOR",77,"A FU ",null,null,"NOT OPERATIONAL"]
[null,null,null,"GB3CV","DMU29",439.36250000000001,430.36250000000001,"IO92FJ",null,null,"COVENTRY","MID",67,"A ",null,null,"OPERATIONAL"]
[null,null,null,"GB3CW","RV49",145.61250000000001,145.01249999999999,"IO90",null,null,"FAREHAM","SW",71.900000000000006,"A ",null,null,"OPERATIONAL"]
[null,null,null,"GB3CY","RU69",430.86250000000001,438.46249999999998,"IO93KW",null,null,"YORK","NOR",88.5,"A ",null,null,"OPERATIONAL"]
[null,null,null,"GB3DA","RV58",145.72499999999999,145.125,"JO01GR",null,null,"DANBURY","EA",110.9,"A FU ",null,null,"OPERATIONAL"]
[null,null,null,"GB3DB","R50-06",50.77,51.27,"JO01HR",null,null,"DANBURY","EA",110.9,"A FU ",null,null,"OPERATIONAL"]
[null,null,null,"GB3DC","RV55",145.6875,145.08750000000001,"IO92GW",null,null,"DERBY","MID",71.900000000000006,"A ",null,null,"OPERATIONAL"]
[null,null,null,"GB3DD","RB10",433.25,434.85,"IO86MM",null,null,"DUNDEE","SCO",94.8,"A FU ",null,null,"OPERATIONAL"]
[null,null,null,"GB3DE","RB07",433.17500000000001,434.77499999999998,"JO02NF",null,null,"IPSWICH","EA",110.9,"A ",null,null,"OPERATIONAL"]
[null,null,null,"GB3DF","DVU50",439.625,430.625,"IO93",null,null,"UPPER DENBY","NOR",82.5,"A DS FU ",null,null,"OPERATIONAL"]
[null,null,null,"GB3DG","RV62",145.77500000000001,145.17500000000001,"IO74UV",null,null,"NEWTON STEWART","SCO",103.5,"A FU ",null,null,"OPERATIONAL"]
[null,null,null,"GB3DI","RB06",433.15,434.75,"IO91",null,null,"DIDCOT","SW",118.8,"A ",null,null,"OPERATIONAL"]
[null,null,null,"GB3DK","RB0",433,434.6,"IO97",null,null,"PETERHEAD","SCO",67,"A ",null,null,"NOT OPERATIONAL"]
[null,null,null,"GB3DL","DVU34",439.42500000000001,430.42500000000001,"JO02NI",null,null,"DISS","EA",110.9,"A DS ",null,null,"OPERATIONAL"]
[null,null,null,"GB3DM","RU74",430.92500000000001,438.52499999999998,"IO75QX",null,null,"DUMBARTON","SCO",103.5,"A DS FU ",null,null,"OPERATIONAL"]
[null,null,null,"GB3DN","RV51",145.63749999999999,145.03749999999999,"IO70UW",null,null,"STIBB CROSS","SW",77,"A FU ",null,null,"OPERATIONAL"]
[null,null,null,"GB3DP","DVU34",439.42500000000001,430.42500000000001,"IO92TR",null,null,"BASTON","EA",88.5,"A FU ",null,null,"OPERATIONAL"]
[null,null,null,"GB3DQ","RU78",430.97500000000002,438.57499999999999,"IO70RI",null,null,"POLPERRO","SW",77,"A ",null,null,"OPERATIONAL"]
[null,null,null,"GB3DR","RV59",145.73750000000001,145.13749999999999,"IO80SN",null,null,"WEYMOUTH","SW",null,"A FU ",null,null,"OPERATIONAL"]
[null,null,null,"GB3DS","RB13",433.32499999999999,434.92500000000001,"IO93KH",null,null,"WORKSOP","MID",71.900000000000006,"A ",null,null,"OPERATIONAL"]
[null,null,null,"GB3DT","RB0",433,434.6,"IO80WU",null,null,"BLANDFORD","SW",71.900000000000006,"A FU ",null,null,"OPERATIONAL"]
[null,null,null,"GB3DU","RV61",145.76249999999999,145.16249999999999,"IO85",null,null,"DUNS ","SCO",118.8,"A DM ",null,null,"OPERATIONAL"]
[null,null,null,"GB3DX","RB12",433.3,434.9,"IO65HA",null,null,"DERRY/LONDONDERRY","NI",110.9,"A ",null,null,"OPERATIONAL"]
[null,null,null,"GB3DY","RB10",433.25,434.85,"IO93",null,null,"WIRKSWORTH","MID",71.900000000000006,"A DM ",null,null,"NOT OPERATIONAL"]
[null,null,null,"GB3DZ","RU79",430.98750000000001,438.58749999999998,"IO92",null,null,"DERBY","MID",71.900000000000006,"A ",null,null,"OPERATIONAL"]
[null,null,null,"GB3EA ","RV55",145.6875,145.08750000000001,"JO02",null,null,"BURY ST EDMUNDS ","EA",110.9,"A ",null,null,"OPERATIONAL"]
[null,null,null,"GB3EB","RV63",145.78749999999999,145.1875,"JO00AT",null,null,"NEWHAVEN","SE",88.5,"A DM DS ",null,null,"OPERATIONAL"]
[null,null,null,"GB3EC","RBW08",433.1,438.1,"IO83",null,null,"WARRINGTON","NOR",82.5,"A FU ",null,null,"OPERATIONAL"]
[null,null,null,"GB3ED","RU71",430.88749999999999,438.48750000000001,"IO85JW",null,null,"EDINBURGH","SCO",94.8,"A DS ",null,null,"OPERATIONAL"]
[null,null,null,"GB3EE","RB12",433.3,434.9,"IO93",null,null,"MANSFIELD","MID",71.900000000000006,"A ",null,null,"OPERATIONAL"]
[null,null,null,"GB3EF","R50-01",50.72,51.22,"JO02NG",null,null,"SUFFOLK","EA",110.9,"A ",null,null,"OPERATIONAL"]
[null,null,null,"GB3EG","RU73",430.91250000000002,438.51249999999999,"IO83QN",null,null,"WIGAN","NOR",82.5,"A ",null,null,"OPERATIONAL"]
[null,null,null,"GB3EH","RU77",430.96249999999998,438.5625,"IO92GC",null,null,"BANBURY","SW",67,"A ",null,null,"OPERATIONAL"]
[null,null,null,"GB3EI","RV49",145.61250000000001,145.01249999999999,"IO67IN",null,null,"LOCHMADDY","SCO",88.5,"A DM DS FU ",null,null,"OPERATIONAL"]
[null,null,null,"GB3EK","RU71",430.88749999999999,438.48750000000001,"JO01QJ",null,null,"MARGATE","SE",103.5,"A ",null,null,"OPERATIONAL"]
[null,null,null,"GB3EL","RU67",430.83749999999998,438.4375,"JO02DJ",null,null,"ELY","EA",156.69999999999999,"A ",null,null,"REDUCED OUTPUT"]
[null,null,null,"GB3EM","RV61",145.76249999999999,145.16249999999999,"IO92LJ",null,null,"COLD ASHBY","MID",77,"A ",null,null,"OPERATIONAL"]
[null,null,null,"GB3EQ","RV61",145.76249999999999,145.16249999999999,"IO80MW",null,null,"ILMINSTER","SW",94.8,"A FU ",null,null,"OPERATIONAL"]
[null,null,null,"GB3ER","RB03",433.07499999999999,434.67500000000001,"JO01GR",null,null,"DANBURY","EA",110.9,"A FU ",null,null,"OPERATIONAL"]
[null,null,null,"GB3ES","RV54",145.67500000000001,145.07499999999999,"JO00",null,null,"HASTINGS","SE",103.5,"A ",null,null,"OPERATIONAL"]
[null,null,null,"GB3EU","UR67",438.4375,430.83749999999998,"IO92LJ",null,null,"COLD ASHBY","MID",77,"A ",null,null,"NOT OPERATIONAL"]
[null,null,null,"GB3EV","RV56",145.69999999999999,145.1,"IO84SQ",null,null,"DUFTON","NOR",77,"A ",null,null,"OPERATIONAL"]
[null,null,null,"GB3EW","RV49",145.61250000000001,145.01249999999999,"IO80",null,null,"EXETER","SW",77,"A ",null,null,"OPERATIONAL"]
[null,null,null,"GB3EX","RU76",430.95,438.55,"IO80GT",null,null,"SILVERTON","SW",77,"A ",null,null,"OPERATIONAL"]
[null,null,null,"GB3EZ","RU78",430.97500000000002,438.57499999999999,"JO02",null,null,"BURY ST EDMUNDS ","EA",110.9,"A ",null,null,"OPERATIONAL"]
[null,null,null,"GB3FA","RV57",145.71250000000001,145.11250000000001,"IO93HI",null,null,"SHEFFIELD","NOR",82.5,"A ",null,null,"OPERATIONAL"]
[null,null,null,"GB3FC","RU68",430.85,438.45,"IO83LU",null,null,"BLACKPOOL","NOR",82.5,"A ",null,null,"OPERATIONAL"]
[null,null,null,"GB3FE","RV53",145.66249999999999,145.0625,"IO86BC",null,null,"STIRLING","SCO",103.5,"A ",null,null,"OPERATIONAL"]
[null,null,null,"GB3FF","RV48",145.6,145,"IO86",null,null,"UPPER LARGO","SCO",103.5,"A ",null,null,"NOT OPERATIONAL"]
[null,null,null,"GB3FG","RV57",145.71250000000001,145.11250000000001,"IO71",null,null,"CARMARTHEN","WM",94.8,"A FU ",null,null,"OPERATIONAL"]
[null,null,null,"GB3FH","R50-06",50.77,51.27,"IO81OH",null,null,"SOMERSET","SW",77,"A ",null,null,"OPERATIONAL"]
[null,null,null,"GB3FI","RU74",430.92500000000001,438.52499999999998,"IO81OH",null,null,"CHEDDAR","SW",77,"A ",null,null,"OPERATIONAL"]
[null,null,null,"GB3FK","RV60",145.75,145.15,"JO01",null,null,"FOLKESTONE","SE",103.5,"A FU ",null,null,"NOT OPERATIONAL"]
[null,null,null,"GB3FN","RB15",433.375,434.97500000000002,"IO91OF",null,null,"FARNHAM","SW",82.5,"A ",null,null,"OPERATIONAL"]
[null,null,null,"GB3FO","DVU-R20",430.25,439.25,"IO83LT",null,null,"BLACKPOOL","NOR",82.5,"A ",null,null,"OPERATIONAL"]
[null,null,null,"GB3FR","RV62",145.77500000000001,145.17500000000001,"JO03AE",null,null,"SPILSBY LINCS.","EA",71.900000000000006,"A ",null,null,"OPERATIONAL"]
[null,null,null,"GB3FU","RV60",145.75,145.15,"IO92",null,null,"NOTTINGHAM","MID",71.900000000000006,"A ",null,null,"REDUCED OUTPUT"]
[null,null,null,"GB3FV","RU65",430.8125,438.41250000000002,"IO86",null,null,"STIRLING","SCO",88.5,"A DM DS FU ",null,null,"OPERATIONAL"]
[null,null,null,"GB3FX","R50-10",50.81,51.31,"IO91OF",null,null,"FARNHAM","SW",82.5,"A ",null,null,"OPERATIONAL"]
[null,null,null,"GB3GB","DMU27",439.33749999999998,430.33749999999998,"IO92BM",null,null,"SUTTON COLDFIELD","MID",67,"A ",null,null,"REDUCED OUTPUT"]
[null,null,null,"GB3GC","R50-04",50.75,51.25,"IO91BS",null,null,"NORTHLEACH","SW",77,"A ",null,null,"NOT OPERATIONAL"]
[null,null,null,"GB3GD","RV50",145.625,145.02500000000001,"IO74SG",null,null,"SNAEFELL IOM","NOR",110.9,"A ",null,null,"OPERATIONAL"]
[null,null,null,"GB3GF","RB12",433.3,434.9,"IO91RF",null,null,"GUILDFORD","SW",88.5,"A ",null,null,"OPERATIONAL"]
[null,null,null,"GB3GH","RB05",433.125,434.72500000000002,"IO81VU",null,null,"GLOUCESTER","SW",118.8,"A ",null,null,"OPERATIONAL"]
[null,null,null,"GB3GJ","RV51",145.63749999999999,145.03749999999999,"IN89WE",null,null,"ST HELIER","SW",71.900000000000006,"A ",null,null,"OPERATIONAL"]
[null,null,null,"GB3GL","RU72",430.9,438.5,"IO75WU",null,null,"GLASGOW","SCO",103.5,"A FU ",null,null,"OPERATIONAL"]
[null,null,null,"GB3GM","RV50",145.625,145.02500000000001,"IO82UC",null,null,"GREAT MALVERN","MID",67,"FU ",null,null,"OPERATIONAL"]
[null,null,null,"GB3GN","RV62",145.77500000000001,145.17500000000001,"IO87TA",null,null,"BANCHORY","SCO",67,"A ",null,null,"OPERATIONAL"]
[null,null,null,"GB3GO","RV63",145.78749999999999,145.1875,"IO83BH",null,null,"LLANDUDNO","WM",110.9,"A FU ",null,null,"NOT OPERATIONAL"]
[null,null,null,"GB3GR","RU68",430.85,438.45,"IO92QV",null,null,"GRANTHAM","MID",71.900000000000006,"A ",null,null,"OPERATIONAL"]
[null,null,null,"GB3GU","RB13",433.32499999999999,434.92500000000001,"IN89RK",null,null,"GUERNSEY","SW",71.900000000000006,"A ",null,null,"OPERATIONAL"]
[null,null,null,"GB3HA","RV60",145.75,145.15,"IO84",null,null,"HEXHAM","NOR",118.8,"A FU ",null,null,"OPERATIONAL"]
[null,null,null,"GB3HB","RB15",433.375,434.97500000000002,"IO70OJ",null,null,"ROCHE","SW",77,"A FU ",null,null,"NOT OPERATIONAL"]
[null,null,null,"GB3HC","RB06",433.15,434.75,"IO82PB",null,null,"HEREFORD","MID",118.8,"A FU ",null,null,"NOT OPERATIONAL"]
[null,null,null,"GB3HD","RB09",433.22500000000002,434.82499999999999,"IO93BP",null,null,"HUDDERSFIELD","NOR",82.5,"A FU ",null,null,"OPERATIONAL"]
[null,null,null,"GB3HE","RU74",430.92500000000001,438.52499999999998,"JO00HV",null,null,"HASTINGS","SE",103.5,"A FU ",null,null,"OPERATIONAL"]
[null,null,null,"GB3HF","RH4",29.69,29.59,"IO82",null,null,"LLANGOLLEN","WM",103.5,"A ",null,null,"NOT OPERATIONAL"]
[null,null,null,"GB3HG","RV50",145.625,145.02500000000001,"IO94JF",null,null,"THIRSK","NOR",88.5,"A FU ",null,null,"OPERATIONAL"]
[null,null,null,"GB3HH","RV56",145.69999999999999,145.1,"IO93BF",null,null,"BUXTON","MID",71.900000000000006,"A ",null,null,"OPERATIONAL"]
[null,null,null,"GB3HI","RV56",145.69999999999999,145.1,"IO76DK",null,null,"ISLE OF MULL","SCO",103.5,"A ",null,null,"OPERATIONAL"]
[null,null,null,"GB3HJ","RB01",433.02499999999998,434.625,"IO94EB",null,null,"HARROGATE","NOR",118.8,"A ",null,null,"OPERATIONAL"]
[null,null,null,"GB3HK","RB02",433.05,434.65,"IO85",null,null,"SELKIRK","SCO",118.8,"A "]
[null,null,null,"GB3HL","RU71",430.88749999999999,438.48750000000001,"IO87",null,null,"LESLIE","SCO",67,"A DM ",null,null,"OPERATIONAL"]
[null,null,null,"GB3HM","R50-11",50.82,51.32,"IO93GA",null,null,"BELPER","MID",71.900000000000006,"A ",null,null,"OPERATIONAL"]
[null,null,null,"GB3HN","DVU48",439.6,430.6,"IO82",null,null,"LUDLOW","MID",103.5,"A ",null,null,"OPERATIONAL"]
[null,null,null,"GB3HO","RU71",430.88749999999999,438.48750000000001,"IO91TB",null,null,"HORSHAM","SE",88.5,"A ",null,null,"OPERATIONAL"]
[null,null,null,"GB3HP","DMU26",439.32499999999999,430.32499999999999,"IO83MH",null,null,"HOOTON  WIRRAL","MID",67,"A ",null,null,"OPERATIONAL"]
[null,null,null,"GB3HR","RB14",433.35,434.95,"IO91TO",null,null,"HARROW","SE",82.5,"A ",null,null,"OPERATIONAL"]
[null,null,null,"GB3HS","RV52",145.65,145.05000000000001,"IO93RS",null,null,"HULL","NOR",88.5,"A DS FU ",null,null,"OPERATIONAL"]
[null,null,null,"GB3HT","RB11",433.27499999999998,434.875,"IO92HN",null,null,"HINCKLEY","MID",77,"A ",null,null,"OPERATIONAL"]
[null,null,null,"GB3HU","RV48",145.6,145,"IO93BP",null,null,"HUDDERSFIELD","NOR",82.5,"A ",null,null,"OPERATIONAL"]
[null,null,null,"GB3HW","RB13",433.32499999999999,434.92500000000001,"JO01CN",null,null,"GIDEA PARK","SE",110.9,"A ",null,null,"OPERATIONAL"]
[null,null,null,"GB3HY","RU72",430.9,438.5,"IO90WX",null,null,"HAYWARDS HEATH","SE",88.5,"A ",null,null,"OPERATIONAL"]
[null,null,null,"GB3IC","RB05",433.125,434.72500000000002,"IO82",null,null,"WOLVERHAMPTON","MID",67,"A FU ",null,null,"OPERATIONAL"]
[null,null,null,"GB3IG","RV62",145.77500000000001,145.17500000000001,"IO68QE",null,null,"STORNOWAY","SCO",88.5,"A ",null,null,"OPERATIONAL"]
[null,null,null,"GB3IH","RB04",433.1,434.7,"JO02OB",null,null,"IPSWICH","EA",110.9,"A ",null,null,"OPERATIONAL"]
[null,null,null,"GB3II","RV56",145.69999999999999,145.1,"JO02NH",null,null,"NR EYE","EA",110.9,"A ",null,null,"OPERATIONAL"]
[null,null,null,"GB3IK","RV61",145.76249999999999,145.16249999999999,"JO01FJ",null,null,"ROCHESTER","SE",103.5,"A ",null,null,"OPERATIONAL"]
[null,null,null,"GB3IM-C","RU66",430.82499999999999,438.42500000000001,"IO74SD",null,null,"DOUGLAS  IOM","NOR",110.9,"A ",null,null,"OPERATIONAL"]
[null,null,null,"GB3IM-P","RU70",430.875,438.47500000000002,"IO74PF",null,null,"PEEL","NOR",110.9,"A ",null,null,"OPERATIONAL"]
[null,null,null,"GB3IM-R","RU66",430.82499999999999,438.42500000000001,"IO74TI",null,null,"RAMSEY  IOM","NOR",71.900000000000006,"A ",null,null,"OPERATIONAL"]
[null,null,null,"GB3IM-S","RB05",433.125,434.72500000000002,"IO74SG",null,null,"DOUGLAS  IOM","NOR",110.9,"A ",null,null,"OPERATIONAL"]
[null,null,null,"GB3IN","RV51",145.63749999999999,145.03749999999999,"IO93GC",null,null,"TANSLEY NR MATLOCK","MID",71.900000000000006,"A DM DS FU NX ",null,null,"OPERATIONAL"]
[null,null,null,"GB3IP","RU70",430.875,438.47500000000002,"IO81",null,null,"LONG ASHTON  BRISTOL","SW",118.8,"A DM ",null,null,"OPERATIONAL"]
[null,null,null,"GB3IR","RV61",145.76249999999999,145.16249999999999,"IO94DJ",null,null,"RICHMOND YORKS","NOR",88.5,"A ",null,null,"OPERATIONAL"]
[null,null,null,"GB3IS","RU71",430.88749999999999,438.48750000000001,"IO67HC",null,null,"ISLE OF SOUTH UIST","SCO",94.8,"A DM DS FU ",null,null,"OPERATIONAL"]
[null,null,null,"GB3IW","RB09",433.22500000000002,434.82499999999999,"IO90IQ",null,null,"NEWPORT","SW",71.900000000000006,"A FU ",null,null,"OPERATIONAL"]
[null,null,null,"GB3JB","RV63",145.78749999999999,145.1875,"IO81VC",null,null,"MERE WILTSHIRE","SW",103.5,"A DM ",null,null,"OPERATIONAL"]
[null,null,null,"GB3JG","DVU62",439.77499999999998,430.77499999999998,"IO80SO",null,null,"WEYMOUTH","SW",71.900000000000006,"A FU ",null,null,"OPERATIONAL"]
[null,null,null,"GB3JH","RU69",430.86250000000001,438.46249999999998,"IO81EA",null,null,"TIVERTON","SW",77,"A DM ",null,null,"OPERATIONAL"]
[null,null,null,"GB3JL","RV63",145.78749999999999,145.1875,"IO70SM",null,null,"LISKEARD","SW",77,"A ",null,null,"OPERATIONAL"]
[null,null,null,"GB3JR","RU78",430.97500000000002,438.57499999999999,"IO93HB",null,null,"MANSFIELD","MID",71.900000000000006,"A ",null,null,"OPERATIONAL"]
[null,null,null,"GB3JS","RU67",430.83749999999998,438.4375,"JO02UO",null,null,"GREAT YARMOUTH ","EA",94.8,"A ",null,null,"OPERATIONAL"]
[null,null,null,"GB3JZ","RU73",430.91250000000002,438.51249999999999,"IO90HX",null,null,"EASTLEIGH","SW",71.900000000000006,"A ",null,null,"OPERATIONAL"]
[null,null,null,"GB3KA","RU71",430.88749999999999,438.48750000000001,"IO82",null,null,"KIDDERMINSTER","MID",118.8,"A ",null,null,"OPERATIONAL"]
[null,null,null,"GB3KB","RH4",29.69,29.59,"JO01BL",null,null,"ERITH","SE",103.5,"A ",null,null,"NOT OPERATIONAL"]
[null,null,null,"GB3KC","RU72",430.9,438.5,"IO82WK",null,null,"STOURBRIDGE","MID",67,"A ",null,null,"OPERATIONAL"]
[null,null,null,"GB3KD","RV63",145.78749999999999,145.1875,"IO82",null,null,"KIDDERMINSTER","MID",118.8,"A ",null,null,"OPERATIONAL"]
[null,null,null,"GB3KE","RV55",145.6875,145.08750000000001,"IO75UV",null,null,"GLASGOW","SCO",103.5,"A FU ",null,null,"OPERATIONAL"]
[null,null,null,"GB3KH","RBW30",433.375,438.375,"JO01GJ",null,null,"CHATHAM ","SE",103.5,"A ",null,null,"OPERATIONAL"]
[null,null,null,"GB3KI","RV53",145.66249999999999,145.0625,"JO01NI",null,null,"HERNE BAY","SE",103.5,"A DS ",null,null,"OPERATIONAL"]
[null,null,null,"GB3KK","RU78",430.97500000000002,438.57499999999999,"IO65VE",null,null,"BALLYCASTLE","NI",110.9,"A ",null,null,"OPERATIONAL"]
[null,null,null,"GB3KL","RB04",433.1,434.7,"JO02FR",null,null,"KINGS LYNN","EA",94.8,"A FU ",null,null,"OPERATIONAL"]
[null,null,null,"GB3KN","RV56",145.69999999999999,145.1,"JO01HH",null,null,"MAIDSTONE","SE",103.5,"A ",null,null,"OPERATIONAL"]
[null,null,null,"GB3KR","RU65",430.8125,438.41250000000002,"IO82UI",null,null,"STOURPORT ON SEVERN","MID",118.8,"A ",null,null,"OPERATIONAL"]
[null,null,null,"GB3KS","RV50",145.625,145.02500000000001,"JO01PA",null,null,"DOVER","SE",103.5,"A FU ",null,null,"OPERATIONAL"]
[null,null,null,"GB3KT","RU68",430.85,438.45,"IO93AU",null,null,"KEIGHLEY","NOR",74.400000000000006,"A ",null,null,"OPERATIONAL"]
[null,null,null,"GB3KU","RB03",433.07499999999999,434.67500000000001,"IO83XM",null,null,"ASHTON-UNDER-LYNE","NOR",82.5,"A DM DS FU NX ",null,null,"OPERATIONAL"]
[null,null,null,"GB3KV","RU78",430.97500000000002,438.57499999999999,"IO75XX",null,null,"KILSYTH","SCO",103.5,"A ",null,null,"OPERATIONAL"]
[null,null,null,"GB3KW","RU66",430.82499999999999,438.42500000000001,"IO75UV",null,null,"GLASGOW","SCO",103.5,"A FU ",null,null,"OPERATIONAL"]
[null,null,null,"GB3KX","RU67",430.83749999999998,438.4375,"IO91",null,null,"LONDON","SE",82.5,"A ",null,null,"NOT OPERATIONAL"]
[null,null,null,"GB3KY","RV57",145.71250000000001,145.11250000000001,"JO02FS",null,null,"KINGS LYNN","EA",94.8,"A ",null,null,"OPERATIONAL"]
[null,null,null,"GB3LA","RV57",145.71250000000001,145.11250000000001,"IO85CJ",null,null,"SANQUHAR","SCO",103.5,"A ",null,null,"OPERATIONAL"]
[null,null,null,"GB3LB","RV63",145.78749999999999,145.1875,"IO85",null,null,"LAUDER","SCO",118.8,"A ",null,null,"OPERATIONAL"]
[null,null,null,"GB3LC","RU75",430.9375,438.53750000000002,"IO93WH",null,null,"LOUTH","MID",71.900000000000006,"A DM DS FU NX ",null,null,"OPERATIONAL"]
[null,null,null,"GB3LD","RV54",145.67500000000001,145.07499999999999,"IO84OA",null,null,"LANCASTER","NOR",110.9,"A ",null,null,"OPERATIONAL"]
[null,null,null,"GB3LE","RB04",433.1,434.7,"IO92IQ",null,null,"MARKFIELD","MID",77,"A FU ",null,null,"OPERATIONAL"]
[null,null,null,"GB3LF","RB14",433.35,434.95,"IO84PH",null,null,"KENDAL","NOR",110.9,"A ",null,null,"OPERATIONAL"]
[null,null,null,"GB3LG","R50-12",50.83,51.33,"IO82",null,null,"LLANGOLLEN","WM",null,"A ",null,null,"NOT OPERATIONAL"]
[null,null,null,"GB3LH","RB15",433.375,434.97500000000002,"IO82OP",null,null,"SHREWSBURY","MID",103.5,"A FU ",null,null,"OPERATIONAL"]
[null,null,null,"GB3LI","RB10",433.25,434.85,"IO83LL",null,null,"LIVERPOOL","NOR",82.5,"A ",null,null,"OPERATIONAL"]
[null,null,null,"GB3LL","RB0",433,434.6,"IO82",null,null,"LLANGOLLEN","WM",94.8,"A ",null,null,"OPERATIONAL"]
[null,null,null,"GB3LM","RV58",145.72499999999999,145.125,"IO93RF",null,null,"LINCOLN","MID",71.900000000000006,"A FU ",null,null,"OPERATIONAL"]
[null,null,null,"GB3LN","RU74",430.92500000000001,438.52499999999998,"IO92KO",null,null,"LEICESTER","MID",118.8,"A ",null,null,"OPERATIONAL"]
[null,null,null,"GB3LP","R50-04",50.75,51.25,"IO83MK",null,null,"LIVERPOOL","NOR",77,"A ",null,null,"OPERATIONAL"]
[null,null,null,"GB3LR","RU69",430.86250000000001,438.46249999999998,"JO00AS",null,null,"NEWHAVEN","SE",88.5,"A ",null,null,"OPERATIONAL"]
[null,null,null,"GB3LS","RB02",433.05,434.65,"IO93RF",null,null,"LINCOLN","MID",71.900000000000006,"A ",null,null,"OPERATIONAL"]
[null,null,null,"GB3LT","RB10",433.25,434.85,"IO91SV",null,null,"LUTON","SE",77,"A FU ",null,null,"OPERATIONAL"]
[null,null,null,"GB3LU","RV54",145.67500000000001,145.07499999999999,"IP90JD",null,null,"LERWICK","SCO",77,"A ",null,null,"OPERATIONAL"]
[null,null,null,"GB3LV","RB02",433.05,434.65,"IO91XP",null,null,"NORTH LONDON","SE",82.5,"A ",null,null,"OPERATIONAL"]
[null,null,null,"GB3LY","RV48",145.6,145,"IO65NC",null,null,"LIMAVADY","NI",110.9,"A ",null,null,"OPERATIONAL"]
[null,null,null,"GB3LZ","RV53",145.66249999999999,145.0625,"IO80AU",null,null,"WINKLEIGH","SW",77,"A DM FU ",null,null,"OPERATIONAL"]
[null,null,null,"GB3MA","R50-01",50.72,51.22,"IO83SM",null,null,"ATHERTON","NOR",82.5,"A ",null,null,"NOT OPERATIONAL"]
[null,null,null,"GB3MB","RB15",433.375,434.97500000000002,"IO81HR",null,null,"MERTHYR","WM",94.8,"A FU ",null,null,"OPERATIONAL"]
[null,null,null,"GB3MC","DMU27",439.33749999999998,430.33749999999998,"IO83KJ",null,null,"LEASOWE","NOR",110.9,"A FU ",null,null,"OPERATIONAL"]
[null,null,null,"GB3MD","RU77",430.96249999999998,438.5625,"IO82GN",null,null,"LLANFAIR CAEREINION","WM",103.5,"A FU ",null,null,"NOT OPERATIONAL"]
[null,null,null,"GB3ME","RB06",433.15,434.75,"IO92JJ",null,null,"RUGBY","MID",67,"A ",null,null,"OPERATIONAL"]
[null,null,null,"GB3MG","RU72",430.9,438.5,"IO81KP",null,null,"PONTYPRIDD","WM",null,"A FU ",null,null,"OPERATIONAL"]
[null,null,null,"GB3MH","RV50",145.625,145.02500000000001,"IO91WC",null,null,"EAST GRINSTEAD","SE",88.5,"A ",null,null,"OPERATIONAL"]
[null,null,null,"GB3MI","RV57",145.71250000000001,145.11250000000001,"IO83",null,null,"MANCHESTER","NOR",82.5,"A ",null,null,"OPERATIONAL"]
[null,null,null,"GB3MK","RB0",433,434.6,"IO92OB",null,null,"MILTON KEYNES","SE",77,"A FU ",null,null,"OPERATIONAL"]
[null,null,null,"GB3ML","RU73",430.91250000000002,438.51249999999999,"IO91RK",null,null,"STAINES UPON THAMES","SE",103.5,"A DM DS FU ",null,null,"OPERATIONAL"]
[null,null,null,"GB3MN","RV52",145.65,145.05000000000001,"IO83XH",null,null,"DISLEY","NOR",82.5,"A FU ",null,null,"OPERATIONAL"]
[null,null,null,"GB3MO","UR63",438.38749999999999,430.78750000000002,"IO84",null,null,"MORECAMBE","NOR",110.9,"A ",null,null,"OPERATIONAL"]
[null,null,null,"GB3MP","RV60",145.75,145.15,"IO83",null,null,"PRESTATYN","WM",110.9,"A ",null,null,"OPERATIONAL"]
[null,null,null,"GB3MR","RB14",433.35,434.95,"IO83XH",null,null,"STOCKPORT","NOR",82.5,"A ",null,null,"OPERATIONAL"]
[null,null,null,"GB3MS ","RB0",433,434.6,"IO82UC",null,null,"MALVERN ","MID",67,"A FU ",null,null,"NOT OPERATIONAL"]
[null,null,null,"GB3MT","RV52",145.65,145.05000000000001,"IO64QS",null,null,"MAGHERAFELT","NI",110.9,"A ",null,null,"OPERATIONAL"]
[null,null,null,"GB3MW","RB10",433.25,434.85,"IO92FH",null,null,"LEAMINGTON SPA","MID",67,"A ",null,null,"OPERATIONAL"]
[null,null,null,"GB3MX","RV51",145.63749999999999,145.03749999999999,"IO84GQ",null,null,"MARYPORT","NOR",77,"A FU ",null,null,"OPERATIONAL"]
[null,null,null,"GB3MY","RB11",433.27499999999998,434.875,"IO83SM",null,null,"ATHERTON","NOR",82.5,"A FU ",null,null,"OPERATIONAL"]
[null,null,null,"GB3NA","RV49",145.61250000000001,145.01249999999999,"IO93HN",null,null,"BARNSLEY","NOR",71.900000000000006,"A DS FU ",null,null,"OPERATIONAL"]
[null,null,null,"GB3NB","RV50",145.625,145.02500000000001,"JO02PN",null,null,"NORWICH","EA",94.8,"A ",null,null,"OPERATIONAL"]
[null,null,null,"GB3NC","RV58",145.72499999999999,145.125,"IO70OJ",null,null,"ROCHE","SW",77,"A FU ",null,null,"OPERATIONAL"]
[null,null,null,"GB3ND","DVU59",439.73750000000001,430.73750000000001,"IO70UU",null,null,"NEAR HOLSWORTHY","SW",null,"DM ",null,null,"OPERATIONAL"]
[null,null,null,"GB3NE","RV61",145.76249999999999,145.16249999999999,"IO91HJ",null,null,"NEWBURY","SW",118.8,"A ",null,null,"OPERATIONAL"]
[null,null,null,"GB3NF","RV50",145.625,145.02500000000001,"IO92",null,null,"NOTTINGHAM","MID",77,"A DM FU ",null,null,"OPERATIONAL"]
[null,null,null,"GB3NG","RV50",145.625,145.02500000000001,"IO87XO",null,null,"FRASERBURGH","SCO",67,"A ",null,null,"OPERATIONAL"]
[null,null,null,"GB3NH","RU76",430.95,438.55,"IO92NF",null,null,"NORTHAMPTON","MID",77,"A ",null,null,"OPERATIONAL"]
[null,null,null,"GB3NI","RV58",145.72499999999999,145.125,"IO74CO",null,null,"BELFAST  N.I.","NI",110.9,"A ",null,null,"OPERATIONAL"]
[null,null,null,"GB3NK","RB04",433.1,434.7,"JO01BL",null,null,"ERITH","SE",103.5,"A ",null,null,"OPERATIONAL"]
[null,null,null,"GB3NL","RV62",145.77500000000001,145.17500000000001,"IO91XP",null,null,"NORTH LONDON","SE",82.5,"A ",null,null,"OPERATIONAL"]
[null,null,null,"GB3NM","RB07",433.17500000000001,434.77499999999998,"IO92",null,null,"NOTTINGHAM","MID",71.900000000000006,"A ",null,null,"OPERATIONAL"]
[null,null,null,"GB3NN","RB02",433.05,434.65,"JO02JV",null,null,"WELLS NORFOLK","EA",94.8,"A ",null,null,"OPERATIONAL"]
[null,null,null,"GB3NP","RU71",430.88749999999999,438.48750000000001,"IO92LD",null,null,"TOWCESTER","MID",77,"A FU ",null,null,"OPERATIONAL"]
[null,null,null,"GB3NR","RB0",433,434.6,"JO02PP",null,null,"NORWICH","EA",94.8,"A ",null,null,"OPERATIONAL"]
[null,null,null,"GB3NS","DVU54",439.67500000000001,430.67500000000001,"IO91",null,null,"BANSTEAD","SE",82.5,"A ",null,null,"OPERATIONAL"]
[null,null,null,"GB3NT","RB0",433,434.6,"IO94EW",null,null,"NEWCASTLE UPON TYNE","NOR",118.8,"A FU ",null,null,"OPERATIONAL"]
[null,null,null,"GB3NW","DVU39",439.48750000000001,430.48750000000001,"IO92",null,null,"NOTTINGHAM","MID",71.900000000000006,"DM ",null,null,"NOT OPERATIONAL"]
[null,null,null,"GB3NX","RV59",145.73750000000001,145.13749999999999,"IO70",null,null,"NEAR HOLSWORTHY","SW",77,"A DM DS FU ",null,null,"OPERATIONAL"]
[null,null,null,"GB3NY","RU67",430.83749999999998,438.4375,"IO93RT",null,null,"HULL","NOR",67,"A FU ",null,null,"OPERATIONAL"]
[null,null,null,"GB3OA","RV49",145.61250000000001,145.01249999999999,"IO83LP",null,null,"SOUTHPORT","NOR",82.5,"A FU ",null,null,"OPERATIONAL"]
[null,null,null,"GB3OC","RV52",145.65,145.05000000000001,"IO88LX",null,null,"KIRKWALL","SCO",77,"A ",null,null,"OPERATIONAL"]
[null,null,null,"GB3OD","DVU-R23",430.28750000000002,439.28750000000002,"IO83BH",null,null,"LLANDUDNO","WM",null,"DM ",null,null,"OPERATIONAL"]
[null,null,null,"GB3OG","RV63",145.78749999999999,145.1875,"IO83BH",null,null,"LLANDUDNO","WM",110.9,"A FU ",null,null,"NOT OPERATIONAL"]
[null,null,null,"GB3OH","RU76",430.95,438.55,"IO85EX",null,null,"LINLITHGOW","SCO",94.8,"A DM DS FU ",null,null,"OPERATIONAL"]
[null,null,null,"GB3OM","RU76",430.95,438.55,"IO64JQ",null,null,"OMAGH","NI",110.9,"A DM ",null,null,"OPERATIONAL"]
[null,null,null,"GB3OP","DMU30",439.375,430.375,"IO90",null,null,"PORTSMOUTH","SW",71.900000000000006,"A ",null,null,"OPERATIONAL"]
[null,null,null,"GB3OR","RU67",430.83749999999998,438.4375,"IO83BH",null,null,"LLANDUDNO","WM",103.5,"A FU ",null,null,"OPERATIONAL"]
[null,null,null,"GB3OV","DMU30",439.375,430.375,"IO92VG",null,null,"GRAVELEY","EA",94.8,"A ",null,null,"OPERATIONAL"]
[null,null,null,"GB3OY","RU76",430.95,438.55,"JO01AO",null,null,"BUCKHURST HILL","SE",82.5,"A ",null,null,"OPERATIONAL"]
[null,null,null,"GB3PA","RV50",145.625,145.02500000000001,"IO75QV",null,null,"PAISLEY","SCO",103.5,"A ",null,null,"OPERATIONAL"]
[null,null,null,"GB3PB","RV50",145.625,145.02500000000001,"IO90AT",null,null,"WIMBORNE","SW",71.900000000000006,"A ",null,null,"OPERATIONAL"]
[null,null,null,"GB3PC","DVU-R23",430.28750000000002,439.28750000000002,"IO81",null,null,"FARNBOROUGH","SW",118.8,"A DM ",null,null,"OPERATIONAL"]
[null,null,null,"GB3PD","RU68",430.85,438.45,"IO80SN",null,null,"WEYMOUTH","SW",null,"A FU ",null,null,"OPERATIONAL"]
[null,null,null,"GB3PE","RV54",145.67500000000001,145.07499999999999,"IO92TL",null,null,"PETERBOROUGH","EA",94.8,"A ",null,null,"OPERATIONAL"]
[null,null,null,"GB3PF","RU74",430.92500000000001,438.52499999999998,"IO83TR",null,null,"ACCRINGTON","NOR",94.8,"A ",null,null,"OPERATIONAL"]
[null,null,null,"GB3PH","RV53",145.66249999999999,145.0625,"IO72SX",null,null,"PWLLHELI","WM",118.8,"A ",null,null,"OPERATIONAL"]
[null,null,null,"GB3PI","RV60",145.75,145.15,"IO92XA",null,null,"ROYSTON","SE",77,"A ",null,null,"OPERATIONAL"]
[null,null,null,"GB3PK","RV53",145.66249999999999,145.0625,"IO65VE",null,null,"BALLYCASTLE","NI",110.9,"A ",null,null,"OPERATIONAL"]
[null,null,null,"GB3PL","RV61",145.76249999999999,145.16249999999999,"IO70XJ",null,null,"PLYMPTON","SW",77,"A ",null,null,"OPERATIONAL"]
[null,null,null,"GB3PM","RU72",430.9,438.5,"IO93",null,null,"SHEFFIELD","NOR",71.900000000000006,"A ",null,null,"OPERATIONAL"]
[null,null,null,"GB3PN","RU76",430.95,438.55,"IO83MR",null,null,"BLACKPOOL","NOR",82.5,"A ",null,null,"OPERATIONAL"]
[null,null,null,"GB3PO","RV52",145.65,145.05000000000001,"JO02OB",null,null,"IPSWICH","EA",110.9,"A ",null,null,"OPERATIONAL"]
[null,null,null,"GB3PP","RB15",433.375,434.97500000000002,"IO83",null,null,"PRESTON","NOR",82.5,"A DM FU ",null,null,"OPERATIONAL"]
[null,null,null,"GB3PR","RV54",145.67500000000001,145.07499999999999,"IO86GI",null,null,"PERTH","SCO",94.8,"A FU ",null,null,"OPERATIONAL"]
[null,null,null,"GB3PT","RU69",430.86250000000001,438.46249999999998,"IO83",null,null,"PRESCO","NOR",94.8,"A ",null,null,"OPERATIONAL"]
[null,null,null,"GB3PU","RB0",433,434.6,"IO86GI",null,null,"PERTH","SCO",94.8,"A FU ",null,null,"OPERATIONAL"]
[null,null,null,"GB3PW","RV62",145.77500000000001,145.17500000000001,"IO82HL",null,null,"NEWTOWN","WM",103.5,"A ",null,null,"OPERATIONAL"]
[null,null,null,"GB3PX",null,50.78,51.78,"IO92XA",null,null,"BARKWAY","SE",77,"A ",null,null,"OPERATIONAL"]
[null,null,null,"GB3PY","RU72",430.9,438.5,"JO02AF",null,null,"CAMBRIDGE","SE",77,"A ",null,null,"OPERATIONAL"]
[null,null,null,"GB3PZ","RU72",430.9,438.5,"IO83XL",null,null,"DUKINFIELD","NOR",82.5,"A ",null,null,"OPERATIONAL"]
[null,null,null,"GB3RA","RV52",145.65,145.05000000000001,"IO82JI",null,null,"LLANDRINDOD WELLS","WM",103.5,"A ",null,null,"NOT OPERATIONAL"]
[null,null,null,"GB3RB","RB08",433.2,434.8,"IO93IF",null,null,"BOLSOVER","MID",71.900000000000006,"A ",null,null,"OPERATIONAL"]
[null,null,null,"GB3RC","RU69",430.86250000000001,438.46249999999998,"IO81",null,null,"CHELTENHAM","SW",103.5,"A ",null,null,"OPERATIONAL"]
[null,null,null,"GB3RD","RV54",145.67500000000001,145.07499999999999,"IO91JM",null,null,"READING","SW",118.8,"A ",null,null,"OPERATIONAL"]
[null,null,null,"GB3RE","RB11",433.27499999999998,434.875,"JO01HH",null,null,"MAIDSTONE","SE",103.5,"A ",null,null,"OPERATIONAL"]
[null,null,null,"GB3RF","RV62",145.77500000000001,145.17500000000001,"IO83TR",null,null,"ACCRINGTON","NOR",82.5,"A ",null,null,"OPERATIONAL"]
[null,null,null,"GB3RH","RB11",433.27499999999998,434.875,"IO80MS",null,null,"AXMINSTER","SW",94.8,"A ",null,null,"OPERATIONAL"]
[null,null,null,"GB3RK","UR63",438.38749999999999,430.78750000000002,"IO74AN",null,null,"BELFAST","NI",88.5,"A ",null,null,"OPERATIONAL"]
[null,null,null,"GB3RL","RU67",430.83749999999998,438.4375,"IO90RT",null,null,"RUSTINGTON","SE",88.5,"A ",null,null,"OPERATIONAL"]
[null,null,null,"GB3RO","RU66",430.82499999999999,438.42500000000001,"IO83UQ",null,null,"HASLINGDEN","NOR",82.5,"A ",null,null,"OPERATIONAL"]
[null,null,null,"GB3RR","RU68",430.85,438.45,"IO82",null,null,"DUDLEY","MID",67,"A ",null,null,"OPERATIONAL"]
[null,null,null,"GB3RT","RV47",145.58750000000001,144.98750000000001,"IO94",null,null,"RICHMOND NORTH YORKSHIRE","NOR",118.8,"A ",null,null,"OPERATIONAL"]
[null,null,null,"GB3RU","RB11",433.27499999999998,434.875,"IO91LK",null,null,"READING","SW",118.8,"A ",null,null,"OPERATIONAL"]
[null,null,null,"GB3RV","RV59",145.73750000000001,145.13749999999999,"IO83UQ",null,null,"HASLINGDEN","NOR",82.5,"A ",null,null,"OPERATIONAL"]
[null,null,null,"GB3RW","RV48",145.6,145,"IO90",null,null,"WORTHING","SE",88.5,"A ",null,null,"OPERATIONAL"]
[null,null,null,"GB3RX","RU65",430.8125,438.41250000000002,"IO83",null,null,"PRESCO","NOR",77,"A FU ",null,null,"OPERATIONAL"]
[null,null,null,"GB3SA","RU70",430.875,438.47500000000002,"IO81AP",null,null,"SWANSEA","WM",94.8,"A ",null,null,"NOT OPERATIONAL"]
[null,null,null,"GB3SB","RV52",145.65,145.05000000000001,"IO85",null,null,"SELKIRK","SCO",118.8,"A ",null,null,"OPERATIONAL"]
[null,null,null,"GB3SC","RU69",430.86250000000001,438.46249999999998,"IO92ES",null,null,"BURTON-UPON-TRENT","MID",67,"A ",null,null,"OPERATIONAL"]
[null,null,null,"GB3SD","RB14",433.35,434.95,"IO80SQ",null,null,"WEYMOUTH","SW",71.900000000000006,"A ",null,null,"OPERATIONAL"]
[null,null,null,"GB3SF","RV50",145.625,145.02500000000001,"IO86",null,null,"PERTH","SCO",null,"FU ",null,null,"OPERATIONAL"]
[null,null,null,"GB3SG","RU73",430.91250000000002,438.51249999999999,"IO81",null,null,"STROUD","SW",118.8,"A ",null,null,"OPERATIONAL"]
[null,null,null,"GB3SH","RV53",145.66249999999999,145.0625,"IO90IV",null,null,"SOUTHAMPTON","SW",71.900000000000006,"A ",null,null,"OPERATIONAL"]
[null,null,null,"GB3SI","RV50",145.625,145.02500000000001,"IO70JB",null,null,"HELSTON","SW",77,"A ",null,null,"OPERATIONAL"]
[null,null,null,"GB3SJ","RV55",145.6875,145.08750000000001,"IO83RF",null,null,"NORTHWICH","NOR",103.5,"A ",null,null,"OPERATIONAL"]
[null,null,null,"GB3SK","RB06",433.15,434.75,"JO01MH",null,null,"CANTERBURY","SE",103.5,"A ",null,null,"OPERATIONAL"]
[null,null,null,"GB3SL","R50-02",50.73,51.23,"IO75XX",null,null,"KILSYTH","SCO",103.5,"A ",null,null,"OPERATIONAL"]
[null,null,null,"GB3SM","RB13",433.32499999999999,434.92500000000001,"IO93BA",null,null,"STOKE ON TRENT","MID",103.5,"A ",null,null,"OPERATIONAL"]
[null,null,null,"GB3SN","RV58",145.72499999999999,145.125,"IO91LC",null,null,"ALTON HANTS","SW",71.900000000000006,"A ",null,null,"OPERATIONAL"]
[null,null,null,"GB3SO","RB0",433,434.6,"JO03AR",null,null,"WITHERNSEA","NOR",71.900000000000006,"A DM DS FU ",null,null,"NOT OPERATIONAL"]
[null,null,null,"GB3SP","RB04",433.1,434.7,"IO71NQ",null,null,"PEMBROKE","WM",94.8,"A FU ",null,null,"OPERATIONAL"]
[null,null,null,"GB3SR","RU73",430.91250000000002,438.51249999999999,"JO03CB",null,null,"SKEGNESS","EA",71.900000000000006,"A ",null,null,"OPERATIONAL"]
[null,null,null,"GB3SS","RV48",145.6,145,"IO87",null,null,"ELGIN MORAY","SCO",67,"A FU ",null,null,"OPERATIONAL"]
[null,null,null,"GB3ST","RB09",433.22500000000002,434.82499999999999,"IO83",null,null,"STOKE ON TRENT","MID",103.5,"A ",null,null,"OPERATIONAL"]
[null,null,null,"GB3SU","RB08",433.2,434.8,"IO90IV",null,null,"SOUTHAMPTON","SW",71.900000000000006,"A ",null,null,"OPERATIONAL"]
[null,null,null,"GB3SV","RV49",145.61250000000001,145.01249999999999,"IO82WS",null,null,"STAFFORD","MID",94.8,"A ",null,null,"OPERATIONAL"]
[null,null,null,"GB3SW","RV57",145.71250000000001,145.11250000000001,"IO80JR",null,null,"SIDMOUTH","SW",77,"A FU ",null,null,"NOT OPERATIONAL"]
[null,null,null,"GB3SX","R50-08",50.79,51.29,"IO93BA",null,null,"STOKE ON TRENT","MID",103.5,"A ",null,null,"OPERATIONAL"]
[null,null,null,"GB3SY","RB06",433.15,434.75,"IO93SE",null,null,"BARNSLEY","NOR",71.900000000000006,"A DS FU ",null,null,"OPERATIONAL"]
[null,null,null,"GB3TC","RU75",430.9375,438.53750000000002,"IO81EN",null,null,"TONDU  BRIDGEND","WM",94.8,"A ",null,null,"NOT OPERATIONAL"]
[null,null,null,"GB3TD","UR63",438.38749999999999,430.78750000000002,"IO91DL",null,null,"SWINDON","SW",118.8,"A ",null,null,"OPERATIONAL"]
[null,null,null,"GB3TE","RV49",145.61250000000001,145.01249999999999,"JO01OT",null,null,"CLACTON ON SEA","EA",67,"A ",null,null,"OPERATIONAL"]
[null,null,null,"GB3TF","RB08",433.2,434.8,"IO82RP",null,null,"TELFORD","MID",103.5,"A FU ",null,null,"OPERATIONAL"]
[null,null,null,"GB3TH","RB15",433.375,434.97500000000002,"IO92",null,null,"TAMWORTH","MID",67,"A FU ",null,null,"OPERATIONAL"]
[null,null,null,"GB3TJ","RB12",433.3,434.9,"IO84",null,null,"HEXHAM","NOR",118.8,"A FU ",null,null,"NOT OPERATIONAL"]
[null,null,null,"GB3TK","RB03",433.07499999999999,434.67500000000001,"IO92",null,null,"NOTTINGHAM","MID",71.900000000000006,"A ",null,null,"OPERATIONAL"]
[null,null,null,"GB3TP","RV58",145.72499999999999,145.125,"IO93CT",null,null,"SHIPLEY","NOR",82.5,"A ",null,null,"OPERATIONAL"]
[null,null,null,"GB3TR","RV52",145.65,145.05000000000001,"IO80FM",null,null,"TORQUAY","SW",94.8,"A ",null,null,"OPERATIONAL"]
[null,null,null,"GB3TS","RB07",433.17500000000001,434.77499999999998,"IO94GX",null,null,"SUNDERLAND","NOR",118.8,"A FU ",null,null,"OPERATIONAL"]
[null,null,null,"GB3TU","RB09",433.22500000000002,434.82499999999999,"IO91PS",null,null,"TRING","SE",77,"A ",null,null,"OPERATIONAL"]
[null,null,null,"GB3TW","RV58",145.72499999999999,145.125,"IO94DW",null,null,"GATESHEAD","NOR",118.8,"A FU ",null,null,"NOT OPERATIONAL"]
[null,null,null,"GB3TX",null,29.65,29.55,"JO02QP",null,null,"NORWICH","EA",94.8,"A ",null,null,"NOT OPERATIONAL"]
[null,null,null,"GB3TX","RU65",430.8125,438.41250000000002,"JO02NN",null,null,"WYMONDHAM","EA",94.8,"A ",null,null,"OPERATIONAL"]
[null,null,null,"GB3TX","RV48",145.6,145,"JO02NN",null,null,"WYMONDHAM","EA",94.8,"A ",null,null,"NOT OPERATIONAL"]
[null,null,null,"GB3TY","RV46",145.57499999999999,144.97499999999999,"IO91QF",null,null,"GUILDFORD","SW",88.5,"A ",null,null,"OPERATIONAL"]
[null,null,null,"GB3UB","RB04",433.1,434.7,"IO81UJ",null,null,"BATH AVON","SW",118.8,"A ",null,null,"OPERATIONAL"]
[null,null,null,"GB3UL","RB02",433.05,434.65,"IO74CO",null,null,"BELFAST  N.I.","NI",110.9,"A ",null,null,"OPERATIONAL"]
[null,null,null,"GB3UM","R50-03",50.74,51.24,"IO92IQ",null,null,"MARKFIELD","MID",77,"A ",null,null,"OPERATIONAL"]
[null,null,null,"GB3UO","RU76",430.95,438.55,"IO83LA",null,null,"WREXHAM","WM",110.9,"A FU ",null,null,"OPERATIONAL"]
[null,null,null,"GB3UP","RU73",430.91250000000002,438.51249999999999,"IO71MX",null,null,"FISHGUARD","WM",94.8,"A ",null,null,"OPERATIONAL"]
[null,null,null,"GB3US","RB0",433,434.6,"IO93",null,null,"SHEFFIELD","NOR",103.5,"A ",null,null,"OPERATIONAL"]
[null,null,null,"GB3VA","RV56",145.69999999999999,145.1,"IO91LT",null,null,"BRILL","SE",118.8,"A ",null,null,"OPERATIONAL"]
[null,null,null,"GB3VE","RB04",433.1,434.7,"IO84SQ",null,null,"DUFTON","NOR",77,"A ",null,null,"OPERATIONAL"]
[null,null,null,"GB3VH","RB13",433.32499999999999,434.92500000000001,"IO91VT",null,null,"WELWYN GARDEN CITY","SE",82.5,"A ",null,null,"NOT OPERATIONAL"]
[null,null,null,"GB3VI","R50-15",50.86,51.36,"IO82",null,null,"DUDLEY","MID",67,"A ",null,null,"OPERATIONAL"]
[null,null,null,"GB3VM","RV49",145.61250000000001,145.01249999999999,"IO82QJ",null,null,"TENBURY WELLS","MID",103.5,"A FU ",null,null,"OPERATIONAL"]
[null,null,null,"GB3VN","RU74",430.92500000000001,438.52499999999998,"IO82QI",null,null,"LUDLOW","MID",103.5,"A FU ",null,null,"OPERATIONAL"]
[null,null,null,"GB3VO","RV51",145.63749999999999,145.03749999999999,"IO83LA",null,null,"WREXHAM","WM",110.9,"A FU ",null,null,"OPERATIONAL"]
[null,null,null,"GB3VR","RU65",430.8125,438.41250000000002,"IO91TU",null,null,"HARPENDEN","SE",67,"A ",null,null,"OPERATIONAL"]
[null,null,null,"GB3VS","RU67",430.83749999999998,438.4375,"IO80KW",null,null,"TRULL","SW",94.8,"A ",null,null,"OPERATIONAL"]
[null,null,null,"GB3VT","RV58",145.72499999999999,145.125,"IO83",null,null,"STOKE ON TRENT","MID",103.5,"DS ",null,null,"OPERATIONAL"]
[null,null,null,"GB3VV","RBW22",433.27499999999998,438.27499999999998,"IO91VV",null,null,"STEVENAGE OLD TOWN","SE",82.5,"A ",null,null,"NOT OPERATIONAL"]
[null,null,null,"GB3WA","RU70",430.875,438.47500000000002,"IO75OR",null,null,"DALRY","SCO",103.5,"A ",null,null,"OPERATIONAL"]
[null,null,null,"GB3WB","RB12",433.3,434.9,"IO81MH",null,null,"WESTON-SUPER-MARE","SW",94.8,"A ",null,null,"OPERATIONAL"]
[null,null,null,"GB3WD","RV56",145.69999999999999,145.1,"IO80",null,null,"IVYBRIDGE","SW",77,"A ",null,null,"OPERATIONAL"]
[null,null,null,"GB3WE","RV55",145.6875,145.08750000000001,"IO81MH",null,null,"WESTON-SUPER-MARE","SW",94.8,"A DM DS ",null,null,"OPERATIONAL"]
[null,null,null,"GB3WF","RB14",433.35,434.95,"IO93DV",null,null,"OTLEY","NOR",82.5,"A FU ",null,null,"OPERATIONAL"]
[null,null,null,"GB3WH","RV52",145.65,145.05000000000001,"IO91EM",null,null,"SWINDON","SW",118.8,"A ",null,null,"OPERATIONAL"]
[null,null,null,"GB3WI","RB15",433.375,434.97500000000002,"JO02",null,null,"WISBECH","EA",94.8,"A FU ",null,null,"OPERATIONAL"]
[null,null,null,"GB3WK","RV62",145.77500000000001,145.17500000000001,"IO92FH",null,null,"LEAMINGTON SPA","MID",67,"A ",null,null,"OPERATIONAL"]
[null,null,null,"GB3WL","RU76",430.95,438.55,"IO92BJ",null,null,"WYTHALL","MID",67,"A DS FU ",null,null,"OPERATIONAL"]
[null,null,null,"GB3WM","RB02",433.05,434.65,"IO92AJ",null,null,"LONGBRIDGE","MID",67,"A FU ",null,null,"OPERATIONAL"]
[null,null,null,"GB3WN","UR63",438.38749999999999,430.78750000000002,"IO82XP",null,null,"WOLVERHAMPTON","MID",67,"A ",null,null,"REDUCED OUTPUT"]
[null,null,null,"GB3WO","RU78",430.97500000000002,438.57499999999999,"IO90TT",null,null,"WORTHING","SE",88.5,"A ",null,null,"OPERATIONAL"]
[null,null,null,"GB3WP","RH1",29.66,29.56,"IO93HS",null,null,"LEEDS","NOR",82.5,"A ",null,null,"OPERATIONAL"]
[null,null,null,"GB3WR","RV48",145.6,145,"IO81PH",null,null,"CHEDDAR","SW",94.8,"A ",null,null,"NOT OPERATIONAL"]
[null,null,null,"GB3WS","RV60",145.75,145.15,"IO91WB",null,null,"HORSHAM","SE",88.5,"A ",null,null,"OPERATIONAL"]
[null,null,null,"GB3WT","RV62",145.77500000000001,145.17500000000001,"IO64JQ",null,null,"OMAGH","NI",110.9,"A ",null,null,"OPERATIONAL"]
[null,null,null,"GB3WU","RU79",430.98750000000001,438.58749999999998,"IO84EN",null,null,"WHITEHAVEN","NOR",77,"A DM FU ",null,null,"OPERATIONAL"]
[null,null,null,"GB3WW","RV62",145.77500000000001,145.17500000000001,"IO81CP",null,null,"PORT TALBOT","WM",94.8,"A FU ",null,null,"REDUCED OUTPUT"]
[null,null,null,"GB3WX","R50-12",50.83,51.83,"JO02NN",null,null,"WYMONDHAM","EA",94.8,"A ",null,null,"NOT OPERATIONAL"]
[null,null,null,"GB3WY","R50-09",50.8,51.3,"IO93EP",null,null,"WAKEFIELD","NOR",82.5,"A ",null,null,"OPERATIONAL"]
[null,null,null,"GB3XB",null,144.5625,432.8,"IO83",null,null,"DENTON","NOR",67,"FU ",null,null,"NOT OPERATIONAL"]
[null,null,null,"GB3XD","R50-02",50.73,51.23,"IO93WH",null,null,"LOUTH","MID",71.900000000000006,"A ",null,null,"OPERATIONAL"]
[null,null,null,"GB3XL","RU71",430.88749999999999,438.48750000000001,"IO93CT",null,null,"SHIPLEY","NOR",82.5,"A DM ",null,null,"DMR ONLY"]
[null,null,null,"GB3XN","RU74",430.92500000000001,438.52499999999998,"IO93KJ",null,null,"WORKSOP","MID",71.900000000000006,"A ",null,null,"OPERATIONAL"]
[null,null,null,"GB3XP","RV55",145.6875,145.08750000000001,"IO91VJ",null,null,"MORDEN","SE",82.5,"A FU ",null,null,"REDUCED OUTPUT"]
[null,null,null,"GB3XS","R50-14",50.85,51.35,"IO92MG",null,null,"NORTHAMPTON","MID",77,"A ",null,null,"REDUCED OUTPUT"]
[null,null,null,"GB3XV","DVU-R20",430.25,439.25,"IO92KG",null,null,"DAVENTRY","MID",null,"FU ",null,null,"OPERATIONAL"]
[null,null,null,"GB3XX","RU73",430.91250000000002,438.51249999999999,"IO92KG",null,null,"DAVENTRY","MID",77,"A FU ",null,null,"OPERATIONAL"]
[null,null,null,"GB3YA","RV57",145.71250000000001,145.11250000000001,"IO81LP",null,null,"CWMBRAN","WM",94.8,"A ",null,null,"OPERATIONAL"]
[null,null,null,"GB3YC","RV60",145.75,145.15,"IO94SE",null,null,"FILEY","NOR",88.5,"A ",null,null,"REDUCED OUTPUT"]
[null,null,null,"GB3YK","RV47",145.58750000000001,144.98750000000001,"IO82",null,null,"LLANGOLLEN","WM",94.8,"A DM DS FU NX ",null,null,"NOT OPERATIONAL"]
[null,null,null,"GB3YL","RU70",430.875,438.47500000000002,"JO02UL",null,null,"LOWESTOFT","EA",94.8,"A ",null,null,"OPERATIONAL"]
[null,null,null,"GB3YN","RU79",430.98750000000001,438.58749999999998,"IO93CR",null,null,"CLECKHEATON","NOR",null,"FU ",null,null,"OPERATIONAL"]
[null,null,null,"GB3YW","RV63",145.78749999999999,145.1875,"IO93EP",null,null,"WAKEFIELD","NOR",82.5,"A ",null,null,"OPERATIONAL"]
[null,null,null,"GB3ZA","RV59",145.73750000000001,145.13749999999999,"IO82PB",null,null,"HEREFORD","MID",118.8,"A FU ",null,null,"OPERATIONAL"]
[null,null,null,"GB3ZB","RU66",430.82499999999999,438.42500000000001,"IO81QJ",null,null,"BRISTOL","SW",77,"A ",null,null,"OPERATIONAL"]
[null,null,null,"GB3ZI","RU78",430.97500000000002,438.57499999999999,"IO82",null,null,"STAFFORD","MID",103.5,"A FU ",null,null,"OPERATIONAL"]
[null,null,null,"GB3ZN","RU71",430.88749999999999,438.48750000000001,"IO94GX",null,null,"HEBBURN","NOR",118.8,"A ",null,null,"OPERATIONAL"]
[null,null,null,"GB3ZW","R50-10",50.81,51.31,"IO82HL",null,null,"NEWTOWN POWYS","WM",103.5,"A ",null,null,"OPERATIONAL"]
[null,null,null,"GB3ZX","RU66",430.82499999999999,438.42500000000001,"JO00",null,null,"EASTBOURNE","SE",88.5,"A ",null,null,"OPERATIONAL"]
[null,null,null,"GB3ZY","R50-09",50.8,51.3,"IO81QJ",null,null,"BRISTOL","SW",77,"A ",null,null,"OPERATIONAL"]
[null,null,null,"GB7AA","DVU54",439.67500000000001,430.67500000000001,"IO81RO",null,null,"BRISTOL","SW",null,"DM ",null,null,"OPERATIONAL"]
[null,null,null,"GB7AB","DVU53",439.66250000000002,430.66250000000002,"IO87VD",null,null,"ABERDEEN","SCO",null,"FU ",null,null,"OPERATIONAL"]
[null,null,null,"GB7AC","RU76",430.95,438.55,"IO87",null,null,"LARGS","SCO",103.5,"A DM ",null,null,"OPERATIONAL"]
[null,null,null,"GB7AD","DVU61",439.76249999999999,430.76249999999999,"IO81RO",null,null,"BRISTOL","SW",null,"DS ",null,null,"OPERATIONAL"]
[null,null,null,"GB7AF","RU71",430.88749999999999,438.48750000000001,"IO92",null,null,"HUCKNALL","MID",71.900000000000006,"A DM DS FU NX ",null,null,"OPERATIONAL"]
[null,null,null,"GB7AG","RU72",430.9,438.5,"IO86",null,null,"FORFAR","SCO",94.8,"A DM DS FU ",null,null,"OPERATIONAL"]
[null,null,null,"GB7AI","DMU27",439.33749999999998,430.33749999999998,"IO85",null,null,"HAWICK","SCO",103.5,"A DM ",null,null,"OPERATIONAL"]
[null,null,null,"GB7AL","DVU32",439.4,430.4,"JO02RD",null,null,"IPSWICH","EA",null,"DM ",null,null,"OPERATIONAL"]
[null,null,null,"GB7AN","DVU37",439.46249999999998,430.46249999999998,"IO83TS",null,null,"ACCRINGTON","NOR",null,"FU ",null,null,"OPERATIONAL"]
[null,null,null,"GB7AR","DVU42",439.52499999999998,430.52499999999998,"JO01",null,null,"NEW ASH GREEN","SE",null,"DM DS FU NX ",null,null,"OPERATIONAL"]
[null,null,null,"GB7AS","DVU34",439.42500000000001,430.42500000000001,"JO01KD",null,null,"ASHFORD","SE",null,"DM ",null,null,"OPERATIONAL"]
[null,null,null,"GB7AU","DVU56",439.7,430.7,"IO91QP",null,null,"AMERSHAM","SE",null,"DS FU ",null,null,"OPERATIONAL"]
[null,null,null,"GB7AV","DVU35",439.4375,430.4375,"IO91OT",null,null,"AYLESBURY","SE",null,"DM ",null,null,"OPERATIONAL"]
[null,null,null,"GB7AY","RU65",430.8125,438.41250000000002,"IO75TQ",null,null,"KILMARNOCK","SCO",null,"A FU ",null,null,"OPERATIONAL"]
[null,null,null,"GB7BA","DVU61",439.76249999999999,430.76249999999999,"IO93CS",null,null,"BRADFORD","NOR",null,"DM ",null,null,"OPERATIONAL"]
[null,null,null,"GB7BB","DVU57",439.71249999999998,430.71249999999998,"IO87QP",null,null,"BANFF","SCO",null,"DM ",null,null,"OPERATIONAL"]
[null,null,null,"GB7BC","DVU52",439.65,430.65,"IO90",null,null,"BRIGHTON","SE",null,"DM DS FU NX ",null,null,"OPERATIONAL"]
[null,null,null,"GB7BD","RU76",430.95,438.55,"IO81QJ",null,null,"BRISTOL","SW",null,"DM ",null,null,"OPERATIONAL"]
[null,null,null,"GB7BE","DVU53",439.66250000000002,430.66250000000002,"JO02TK",null,null,"BECCLES","EA",null,"DS FU NX ",null,null,"OPERATIONAL"]
[null,null,null,"GB7BF","DVU-R24",430.3,439.3,"IO83LU",null,null,"BLACKPOOL","NOR",null,"DM DS FU ",null,null,"OPERATIONAL"]
[null,null,null,"GB7BH","DVU46",439.57499999999999,430.57499999999999,"IO90WU",null,null,"BRIGHTON","SE",null,"DM DS FU "]
[null,null,null,"GB7BI","RU66",430.82499999999999,438.42500000000001,"IO77RM",null,null,"MUIR OF ORD","SCO",null,"DM ",null,null,"NOT OPERATIONAL"]
[null,null,null,"GB7BJ","DVU59",439.73750000000001,430.73750000000001,"IO82",null,null,"MALVERN","MID",null,"DM ",null,null,"OPERATIONAL"]
[null,null,null,"GB7BK","DVU59",439.73750000000001,430.73750000000001,"IO91JM",null,null,"READING","SW",null,"DM ",null,null,"OPERATIONAL"]
[null,null,null,"GB7BL","DVU54",439.67500000000001,430.67500000000001,"IO84VV",null,null,"ALLENDALE","NOR",118.8,"A DM DS FU NX ",null,null,"OPERATIONAL"]
[null,null,null,"GB7BM-B","DVU32",439.4,430.4,"IO92BL",null,null,"BIRMINGHAM","MID",null,"DM ",null,null,"OPERATIONAL"]
[null,null,null,"GB7BM-C","RV59",145.73750000000001,145.13749999999999,"IO92BL",null,null,"BIRMINGHAM","MID",67,"A DM ",null,null,"OPERATIONAL"]
[null,null,null,"GB7BP","DVU36",439.45,430.45,"IO91PX",null,null,"MILTON KEYNES","SE",null,"DS ",null,null,"OPERATIONAL"]
[null,null,null,"GB7BR","RU74",430.92500000000001,438.52499999999998,"IO74TI",null,null,"RAMSEY IOM","NOR",null,"DM ",null,null,"OPERATIONAL"]
[null,null,null,"GB7BS","DVU13",439.16250000000002,430.16250000000002,"IO81TK",null,null,"BRISTOL","SW",null,"DM ",null,null,"OPERATIONAL"]
[null,null,null,"GB7BT","DVU51",439.63749999999999,430.63749999999999,"IO81SK",null,null,"BRISTOL","SW",null,"DM DS FU ",null,null,"OPERATIONAL"]
[null,null,null,"GB7BW","DVU58",439.72500000000002,430.72500000000002,"IO93HP",null,null,"WAKEFIELD ","NOR",null,"DM DS FU ",null,null,"OPERATIONAL"]
[null,null,null,"GB7BX","DVU35",439.4375,430.4375,"IO82",null,null,"CLEOBURY NORTH","MID",null,"DM ",null,null,"OPERATIONAL"]
[null,null,null,"GB7BZ","DVU33",439.41250000000002,430.41250000000002,"IO92QF",null,null,"BOZEAT","MID",null,"DS ",null,null,"OPERATIONAL"]
[null,null,null,"GB7CA","RU74",430.92500000000001,438.52499999999998,"IO74SD",null,null,"DOUGLAS","NOR",null,"DM ",null,null,"OPERATIONAL"]
[null,null,null,"GB7CB","DVU57",439.71249999999998,430.71249999999998,"IO85",null,null,"BATHGATE","SCO",null,"DM NX ",null,null,"OPERATIONAL"]
[null,null,null,"GB7CC","RU79",430.98750000000001,438.58749999999998,"IO81",null,null,"CHELTENHAM","SW",94.8,"A ",null,null,"OPERATIONAL"]
[null,null,null,"GB7CD","DVU56",439.7,430.7,"IO81JL",null,null,"CARDIFF","WM",null,"DS ",null,null,"OPERATIONAL"]
[null,null,null,"GB7CE","DVU49",439.61250000000001,430.61250000000001,"JO01NT",null,null,"GREAT CLACTON","EA",null,"FU ",null,null,"OPERATIONAL"]
[null,null,null,"GB7CF","DVU50",439.625,430.625,"IO90LW",null,null,"CLANFIELD","SW",null,"DM ",null,null,"OPERATIONAL"]
[null,null,null,"GB7CG","RV57",145.71250000000001,145.11250000000001,"IO92QA",null,null,"WOBURN SANDS","SE",77,"A FU ",null,null,"OPERATIONAL"]
[null,null,null,"GB7CH","RU66",430.82499999999999,438.42500000000001,"IO86KO",null,null,"KIRRIEMUIR","SCO",94.8,"A DM FU ",null,null,"NOT OPERATIONAL"]
[null,null,null,"GB7CK","DVU59",439.73750000000001,430.73750000000001,"JO01",null,null,"FOLKESTONE","SE",null,"DM ",null,null,"OPERATIONAL"]
[null,null,null,"GB7CL","DVU51",439.63749999999999,430.63749999999999,"JO01OT",null,null,"CLACTON ON SEA","EA",null,"DM ",null,null,"OPERATIONAL"]
[null,null,null,"GB7CM","RV56",145.69999999999999,145.1,"IO80UT",null,null,"MILTON ABBAS","SW",71.900000000000006,"A FU ",null,null,"OPERATIONAL"]
[null,null,null,"GB7CN","RU78",430.97500000000002,438.57499999999999,"IO92",null,null,"CANNOCK","MID",67,"A DM ",null,null,"REDUCED OUTPUT"]
[null,null,null,"GB7CO","DVU39",439.48750000000001,430.48750000000001,"IO90JU",null,null,"FAREHAM","SW",null,"DM DS FU NX ",null,null,"OPERATIONAL"]
[null,null,null,"GB7CP","RU66",430.82499999999999,438.42500000000001,"IO91RO",null,null,"SLOUGH","SW",77,"A FU ",null,null,"OPERATIONAL"]
[null,null,null,"GB7CQ","DVU49",439.61250000000001,430.61250000000001,"IO90",null,null,"WORTHING","SE",null,"DM DS FU ",null,null,"OPERATIONAL"]
[null,null,null,"GB7CS","DVU62",439.77499999999998,430.77499999999998,"IO75VU",null,null,"GLASGOW","SCO",null,"FU ",null,null,"OPERATIONAL"]
[null,null,null,"GB7CT","RV51",145.63749999999999,145.03749999999999,"IO91PS",null,null,"TRING","SE",null,"DM ",null,null,"OPERATIONAL"]
[null,null,null,"GB7CU","DVU61",439.76249999999999,430.76249999999999,"IO84GQ",null,null,"MARYPORT","NOR",null,"DM DS FU ",null,null,"OPERATIONAL"]
[null,null,null,"GB7CW","DVU48",439.6,430.6,"IO91HB",null,null,"WINCHESTER","SW",null,"DM ",null,null,"OPERATIONAL"]
[null,null,null,"GB7CX","RU69",430.86250000000001,438.46249999999998,"IO65OD",null,null,"COLERAINE","NI",null,"DM DS FU ",null,null,"OPERATIONAL"]
[null,null,null,"GB7CY","DVU50",439.625,430.625,"IO94DR",null,null,"CROOK","NOR",null,"FU ",null,null,"OPERATIONAL"]
[null,null,null,"GB7CZ","DVU40",439.5,430.5,"IO94DR",null,null,"CROOK","NOR",118.8,"A DM DS FU NX ",null,null,"OPERATIONAL"]
[null,null,null,"GB7DA","RV62",145.77500000000001,145.17500000000001,"IO85AV",null,null,"AIRDRIE","SCO",null,"DM DS FU ",null,null,"OPERATIONAL"]
[null,null,null,"GB7DB","RV60",145.75,145.15,"IO85RX",null,null,"DUNBAR","SCO",null,"DM ",null,null,"NOT OPERATIONAL"]
[null,null,null,"GB7DC","DMU28",439.35,430.35,"IO92",null,null,"DERBY","MID",71.900000000000006,"A DM DS FU NX ",null,null,"OPERATIONAL"]
[null,null,null,"GB7DD","DVU53",439.66250000000002,430.66250000000002,"IO86",null,null,"DUNDEE","SCO",null,"DM NX ",null,null,"OPERATIONAL"]
[null,null,null,"GB7DE","RV51",145.63749999999999,145.03749999999999,"IO85",null,null,"KENNOWAY  FIFE","SCO",94.8,"A DM ",null,null,"OPERATIONAL"]
[null,null,null,"GB7DG","RU72",430.9,438.5,"IO74",null,null,"PORTPATRICK","SCO",null,"A DM ",null,null,"OPERATIONAL"]
[null,null,null,"GB7DH","DVU47",439.58749999999998,430.58749999999998,"IO83",null,null,"NORTHWICH","NOR",null,"DS FU ",null,null,"OPERATIONAL"]
[null,null,null,"GB7DI","DVU37",439.46249999999998,430.46249999999998,"JO02NB",null,null,"IPSWICH","EA",110.9,"A DS ",null,null,"OPERATIONAL"]
[null,null,null,"GB7DJ","DVU53",439.66250000000002,430.66250000000002,"IO83RF",null,null,"NORTHWICH","NOR",null,"DM ",null,null,"NOT OPERATIONAL"]
[null,null,null,"GB7DK","RV55",145.6875,145.08750000000001,"IO74LV",null,null,"STRANRAER","SCO",103.5,"A FU ",null,null,"NOT OPERATIONAL"]
[null,null,null,"GB7DK-B","DVU52",439.65,430.65,"IO74LV",null,null,"STRANRAER","SCO",null,"DS ",null,null,"OPERATIONAL"]
[null,null,null,"GB7DL","DVU54",439.67500000000001,430.67500000000001,"JO03DD",null,null,"SKEGNESS","EA",null,"DS ",null,null,"OPERATIONAL"]
[null,null,null,"GB7DM","DVU60",439.75,430.75,"IO86NL",null,null,"MONIFIETH","SCO",103.5,"A DM DS FU ",null,null,"OPERATIONAL"]
[null,null,null,"GB7DN","DVU33",439.41250000000002,430.41250000000002,"IO64MW",null,null,"DUNGIVEN","NI",null,"DS ",null,null,"OPERATIONAL"]
[null,null,null,"GB7DO","DVU56",439.7,430.7,"IO93LO",null,null,"DONCASTER","NOR",null,"DM ",null,null,"OPERATIONAL"]
[null,null,null,"GB7DP","DVU47",439.58749999999998,430.58749999999998,"IO71MV",null,null,"TREFFGARNE","WM",null,"DM ",null,null,"NOT OPERATIONAL"]
[null,null,null,"GB7DR","DVU34",439.42500000000001,430.42500000000001,"IO90AR",null,null,"POOLE","SW",null,"DM ",null,null,"OPERATIONAL"]
[null,null,null,"GB7DS","RBW24",433.3,438.3,"JO02IE",null,null,"BURY ST EDMUNDS","EA",null,"DS ",null,null,"OPERATIONAL"]
[null,null,null,"GB7DT","RU75",430.9375,438.53750000000002,"IO70OJ",null,null,"ROCHE","SW",null,"DM ",null,null,"OPERATIONAL"]
[null,null,null,"GB7DX","DVU56",439.7,430.7,"JO00LW",null,null,"NEW ROMNEY","SE",null,"DM DS ",null,null,"OPERATIONAL"]
[null,null,null,"GB7DY","DVU46",439.57499999999999,430.57499999999999,"IO82",null,null,"DUDLEY","MID",null,"DM ",null,null,"OPERATIONAL"]
[null,null,null,"GB7DZ","RBW04",433.05,438.05,"IO83",null,null,"CONGLETON","MID",103.5,"A FU ",null,null,"OPERATIONAL"]
[null,null,null,"GB7EA","DMU30",439.375,430.375,"IO75SV",null,null,"ERSKINE","SCO",null,"A FU ",null,null,"NOT OPERATIONAL"]
[null,null,null,"GB7EB","DVU46",439.57499999999999,430.57499999999999,"JO02TK",null,null,"BECCLES","EA",null,"DM ",null,null,"OPERATIONAL"]
[null,null,null,"GB7EC","RU74",430.92500000000001,438.52499999999998,"IO87",null,null,"ABERDEEN","SCO",null,"DM ",null,null,"OPERATIONAL"]
[null,null,null,"GB7ED","DVU54",439.67500000000001,430.67500000000001,"IO80GR",null,null,"EXETER","SW",null,"DM ",null,null,"OPERATIONAL"]
[null,null,null,"GB7EE","RU74",430.92500000000001,438.52499999999998,"IO85JW",null,null,"EDINBURGH","SCO",null,"DM ",null,null,"OPERATIONAL"]
[null,null,null,"GB7EF","DVU36",439.45,430.45,"IO86",null,null,"LADYBANK","SCO",103.5,"A DM DS FU NX ",null,null,"OPERATIONAL"]
[null,null,null,"GB7EG","DVU61",439.76249999999999,430.76249999999999,"IO91",null,null,"EAST GRINSTEAD","SE",null,"DM ",null,null,"OPERATIONAL"]
[null,null,null,"GB7EH","RU75",430.9375,438.53750000000002,"IO92GC",null,null,"BANBURY","SW",null,"DM ",null,null,"REDUCED OUTPUT"]
[null,null,null,"GB7EI","RU68",430.85,438.45,"IO67IN",null,null,"LOCHMADDY","SCO",88.5,"A DM DS FU ",null,null,"OPERATIONAL"]
[null,null,null,"GB7EL","DVU57",439.71249999999998,430.71249999999998,"IO83",null,null,"NELSON","NOR",null,"DM ",null,null,"OPERATIONAL"]
[null,null,null,"GB7EP","DVU32",439.4,430.4,"IO91UI",null,null,"EPSOM","SE",null,"DM ",null,null,"OPERATIONAL"]
[null,null,null,"GB7EQ","DVU36",439.45,430.45,"IO80MW",null,null,"ILMINSTER","SW",null,"DM ",null,null,"OPERATIONAL"]
[null,null,null,"GB7ER","RV62",145.77500000000001,145.17500000000001,"IO80GR",null,null,"EXETER","SW",77,"A FU ",null,null,"OPERATIONAL"]
[null,null,null,"GB7ES","DVU35",439.4375,430.4375,"JO00DT",null,null,"EASTBOURNE","SE",null,"DS ",null,null,"OPERATIONAL"]
[null,null,null,"GB7EU","RU67",430.83749999999998,438.4375,"IO85JW",null,null,"EDINBURGH","SCO",94.8,"A DM NX ",null,null,"REDUCED OUTPUT"]
[null,null,null,"GB7EV","U94",431.17500000000001,431.17500000000001,"IO85JW",null,null,"EDINBURGH","SCO",null,"DM ",null,null,"NOT OPERATIONAL"]
[null,null,null,"GB7EW","DVU42",439.52499999999998,430.52499999999998,"IO80",null,null,"EXETER","SW",null,"DM ",null,null,"OPERATIONAL"]
[null,null,null,"GB7EX","DVU57",439.71249999999998,430.71249999999998,"JO01GN",null,null,"SOUTHEND ON SEA","SE",null,"DM ",null,null,"OPERATIONAL"]
[null,null,null,"GB7EY","DVU41",439.51249999999999,430.51249999999999,"IO85",null,null,"SELKIRK","SCO",null,"DM DS FU NX ",null,null,"NOT OPERATIONAL"]
[null,null,null,"GB7EZ","DVU62",439.77499999999998,430.77499999999998,"IO92CM",null,null,"CASTLE BROMWICH","MID",null,"DM ",null,null,"OPERATIONAL"]
[null,null,null,"GB7FB","DVU38",439.47500000000002,430.47500000000002,"IO71VA",null,null,"BIDEFORD","SW",null,"DM ",null,null,"OPERATIONAL"]
[null,null,null,"GB7FC","DVU40",439.5,430.5,"IO83LU",null,null,"CLEVELEYS","NOR",null,"DS ",null,null,"OPERATIONAL"]
[null,null,null,"GB7FE","DVU38",439.47500000000002,430.47500000000002,"IO86BC",null,null,"STIRLING","SCO",null,"DM DS FU ",null,null,"OPERATIONAL"]
[null,null,null,"GB7FF","RV59",145.73750000000001,145.13749999999999,"IO85",null,null,"PRESTONPANS","SCO",103.5,"A DM DS FU NX ",null,null,"NOT OPERATIONAL"]
[null,null,null,"GB7FG","RU76",430.95,438.55,"IO71WW",null,null,"CARMARTHEN","WM",94.8,"A FU ",null,null,"OPERATIONAL"]
[null,null,null,"GB7FI","RU71",430.88749999999999,438.48750000000001,"IO81OH",null,null,"AXBRIDGE","SW",null,"DM ",null,null,"OPERATIONAL"]
[null,null,null,"GB7FK-B","DVU54",439.67500000000001,430.67500000000001,"JO01OC",null,null,"FOLKESTONE","SE",null,"DS ",null,null,"OPERATIONAL"]
[null,null,null,"GB7FL","DVU61",439.76249999999999,430.76249999999999,"IO83",null,null,"FRECKLETON","NOR",null,"DS FU ",null,null,"OPERATIONAL"]
[null,null,null,"GB7FO","DVU-R22",430.27499999999998,439.27499999999998,"IO83LT",null,null,"BLACKPOOL","NOR",null,"DM ",null,null,"OPERATIONAL"]
[null,null,null,"GB7FR","DVU40",439.5,430.5,"IO90",null,null,"BARNHAM","SW",null,"DM ",null,null,"NOT OPERATIONAL"]
[null,null,null,"GB7FR","RV57",145.71250000000001,145.11250000000001,"IO90",null,null,"BARNHAM","SW",null,"A DM DS FU NX ",null,null,"NOT OPERATIONAL"]
[null,null,null,"GB7FS","DVU34",439.42500000000001,430.42500000000001,"IO82XN",null,null,"BILSTON","MID",null,"FU ",null,null,"OPERATIONAL"]
[null,null,null,"GB7FT","DVU57",439.71249999999998,430.71249999999998,"IO90",null,null,"PORTSMOUTH","SW",null,"DM ",null,null,"OPERATIONAL"]
[null,null,null,"GB7FU","RU71",430.88749999999999,438.48750000000001,"IO93JA",null,null,"NOTTINGHAM","MID",null,"A FU ",null,null,"OPERATIONAL"]
[null,null,null,"GB7FW","DVU54",439.67500000000001,430.67500000000001,"IO90LU",null,null,"PORTSMOUTH","SW",null,"DS ",null,null,"NOT OPERATIONAL"]
[null,null,null,"GB7FX","RBW10",433.125,438.125,"JO01",null,null,"CHATHAM","SE",74.400000000000006,"DM ",null,null,"OPERATIONAL"]
[null,null,null,"GB7GA","RU72",430.9,438.5,"IO85",null,null,"GALASHIELS","SCO",118.8,"A DM DS FU ",null,null,"NOT OPERATIONAL"]
[null,null,null,"GB7GB","DVU61",439.76249999999999,430.76249999999999,"IO92BM",null,null,"SUTTON COLDFIELD","MID",null,"DM ",null,null,"REDUCED OUTPUT"]
[null,null,null,"GB7GD","RV55",145.6875,145.08750000000001,"IO87WE",null,null,"ABERDEEN","SCO",null,"DM DS FU ",null,null,"OPERATIONAL"]
[null,null,null,"GB7GF","DVU55",439.6875,430.6875,"IO91RF",null,null,"GUILDFORD","SW",null,"DM ",null,null,"OPERATIONAL"]
[null,null,null,"GB7GG","DVU50",439.625,430.625,"IO85AV",null,null,"AIRDRIE","SCO",null,"DM DS FU ",null,null,"OPERATIONAL"]
[null,null,null,"GB7GH","DVU49",439.61250000000001,430.61250000000001,"IO81",null,null,"CHURCHDOWN","SW",null,"DM NX ",null,null,"NOT OPERATIONAL"]
[null,null,null,"GB7GJ","RU72",430.9,438.5,"IN89WE",null,null,"ST HELIER","SW",88.5,"A DM ",null,null,"OPERATIONAL"]
[null,null,null,"GB7GK","DVU39",439.48750000000001,430.48750000000001,"IO87ON",null,null,"KEITH","SCO",null,"DM ",null,null,"OPERATIONAL"]
[null,null,null,"GB7GL","RU68",430.85,438.45,"IO75",null,null,"GLASGOW","SCO",null,"DM ",null,null,"OPERATIONAL"]
[null,null,null,"GB7GM","RU78",430.97500000000002,438.57499999999999,"IO85",null,null,"DUMFRIES","SCO",118.8,"A DM DS FU ",null,null,"OPERATIONAL"]
[null,null,null,"GB7GP","DVU52",439.65,430.65,"IO91PP",null,null,"HIGH WYCOMBE","SE",null,"DM FU ",null,null,"OPERATIONAL"]
[null,null,null,"GB7GR","DVU36",439.45,430.45,"IO92QW",null,null,"GRANTHAM","MID",null,"DM DS FU ",null,null,"OPERATIONAL"]
[null,null,null,"GB7GS","DVU36",439.45,430.45,"JO02EO",null,null,"DOWNHAM MARKET","EA",null,"DM FU ",null,null,"OPERATIONAL"]
[null,null,null,"GB7GT","DVU33",439.41250000000002,430.41250000000002,"IO82",null,null,"CLEE HILL","MID",null,"DM ",null,null,"OPERATIONAL"]
[null,null,null,"GB7GW","RU65",430.8125,438.41250000000002,"IO94FV",null,null,"WASHINGTON","NOR",103.5,"A DM DS FU ",null,null,"OPERATIONAL"]
[null,null,null,"GB7GX","DMU29",439.36250000000001,430.36250000000001,"IO85MW",null,null,"PRESTONPANS ","SCO",103.5,"A DM DS FU NX ",null,null,"OPERATIONAL"]
[null,null,null,"GB7GY","DVU55",439.6875,430.6875,"IN89RL",null,null,"ST. PETER PORT","SW",null,"DM ",null,null,"OPERATIONAL"]
[null,null,null,"GB7HA","DVU-R23",430.28750000000002,439.28750000000002,"IO91TU",null,null,"HARPENDEN","SE",null,"DM DS FU ",null,null,"OPERATIONAL"]
[null,null,null,"GB7HB","DVU50",439.625,430.625,"IO64",null,null,"TANDRAGEE","NI",null,"DM DS FU ",null,null,"OPERATIONAL"]
[null,null,null,"GB7HC","DVU42",439.52499999999998,430.52499999999998,"IO82",null,null,"HEREFORD","MID",null,"DM ",null,null,"OPERATIONAL"]
[null,null,null,"GB7HD","RV55",145.6875,145.08750000000001,"IO70",null,null,"TAVISTOCK","SW",null,"DM ",null,null,"OPERATIONAL"]
[null,null,null,"GB7HF","DVU40",439.5,430.5,"IO80",null,null,"NEWTON ABBOT","SW",null,"DM ",null,null,"OPERATIONAL"]
[null,null,null,"GB7HH","DVU60",439.75,430.75,"JO01CN",null,null,"ROMFORD","SE",null,"DM DS FU ",null,null,"OPERATIONAL"]
[null,null,null,"GB7HI","DVU45",439.5625,430.5625,"IO64XN",null,null,"LISBURN","NI",null,"FU ",null,null,"OPERATIONAL"]
[null,null,null,"GB7HK","RV50",145.625,145.02500000000001,"IO85",null,null,"HAWICK","SCO",103.5,"A DM ",null,null,"NOT OPERATIONAL"]
[null,null,null,"GB7HM","DVU51",439.63749999999999,430.63749999999999,"IO83",null,null,"CAERGWRLE","WM",null,"DM ",null,null,"OPERATIONAL"]
[null,null,null,"GB7HN","RU70",430.875,438.47500000000002,"IO83RL",null,null,"LEIGH","NOR",82.5,"A ",null,null,"OPERATIONAL"]
[null,null,null,"GB7HQ","RV53",145.66249999999999,145.0625,"IO93",null,null,"HUTHWAITE","MID",71.900000000000006,"A DM DS FU NX ",null,null,"OPERATIONAL"]
[null,null,null,"GB7HQ","RB01",433.02499999999998,434.625,"IO93",null,null,"HUTHWAITE","MID",71.900000000000006,"A DM DS FU NX ",null,null,"OPERATIONAL"]
[null,null,null,"GB7HR","DVU36",439.45,430.45,"IO91SL",null,null,"HEATHROW","SE",null,"DM ",null,null,"OPERATIONAL"]
[null,null,null,"GB7HS","DVU34",439.42500000000001,430.42500000000001,"IO83XR",null,null,"HEPTONSTALL","NOR",null,"DM ",null,null,"OPERATIONAL"]
[null,null,null,"GB7HT","DVU59",439.73750000000001,430.73750000000001,"IO95",null,null,"ASHINGTON","NOR",null,"DM ",null,null,"OPERATIONAL"]
[null,null,null,"GB7HU","DVU39",439.48750000000001,430.48750000000001,"IO93RS",null,null,"SOUTH CAVE","NOR",null,"DS ",null,null,"REDUCED OUTPUT"]
[null,null,null,"GB7HW","U321A",434.01875000000001,434.01875000000001,"IO83RO",null,null,"HORWICH","NOR",null,"",null,null,"OPERATIONAL"]
[null,null,null,"GB7HX","DVU46",439.57499999999999,430.57499999999999,"IO93BP",null,null,"HUDDERSFIELD","NOR",null,"DM DS ",null,null,"OPERATIONAL"]
[null,null,null,"GB7HY","DVU46",439.57499999999999,430.57499999999999,"IO83QQ",null,null,"CHORLEY","NOR",null,"DM ",null,null,"OPERATIONAL"]
[null,null,null,"GB7IC-B","DVU36",439.45,430.45,"JO01NI",null,null,"HERNE BAY","SE",null,"DS ",null,null,"OPERATIONAL"]
[null,null,null,"GB7IC-C","RV53",145.66249999999999,145.0625,"JO01NI",null,null,"HERNE BAY","SE",null,"A DS ",null,null,"OPERATIONAL"]
[null,null,null,"GB7IE","RV54",145.67500000000001,145.07499999999999,"IO70WJ",null,null,"PLYMOUTH","SW",77,"A FU ",null,null,"OPERATIONAL"]
[null,null,null,"GB7II","DVU36",439.45,430.45,"IO77UL",null,null,"INVERNESS","SCO",null,"DM ",null,null,"OPERATIONAL"]
[null,null,null,"GB7IK","DVU43",439.53750000000002,430.53750000000002,"JO01FJ",null,null,"ROCHESTER","SE",null,"DM ",null,null,"OPERATIONAL"]
[null,null,null,"GB7IL","RV53",145.66249999999999,145.0625,"IO77UL",null,null,"INVERNESS","SCO",null,"DM ",null,null,"NOT OPERATIONAL"]
[null,null,null,"GB7IN","DVU52",439.65,430.65,"IO93",null,null,"TANSLEY NR MATLOCK","MID",null,"DM ",null,null,"OPERATIONAL"]
[null,null,null,"GB7IQ","DVU46",439.57499999999999,430.57499999999999,"IO80",null,null,"LIVERTON","SW",null,"DM ",null,null,"NOT OPERATIONAL"]
[null,null,null,"GB7IS","DVU43",439.53750000000002,430.53750000000002,"IO81MH",null,null,"WESTON-SUPER-MARE","SW",null,"FU ",null,null,"OPERATIONAL"]
[null,null,null,"GB7IT","DVU41",439.51249999999999,430.51249999999999,"IO81MH",null,null,"WESTON-SUPER-MARE","SW",null,"DM ",null,null,"OPERATIONAL"]
[null,null,null,"GB7IV","RV62",145.77500000000001,145.17500000000001,"IO90IV",null,null,"SOUTHAMPTON","SW",null,"FU ",null,null,"OPERATIONAL"]
[null,null,null,"GB7IX","RU75",430.9375,438.53750000000002,"JO01IM",null,null,"WESTCLIFF ON SEA","SE",110.9,"A DM DS FU NX ",null,null,"OPERATIONAL"]
[null,null,null,"GB7JA","DVU57",439.71249999999998,430.71249999999998,"IO81VC",null,null,"MERE  WILTSHIRE","SW",null,"DM ",null,null,"NOT OPERATIONAL"]
[null,null,null,"GB7JB","DVU37",439.46249999999998,430.46249999999998,"IO81TB",null,null,"WINCANTON","SW",null,"DM ",null,null,"OPERATIONAL"]
[null,null,null,"GB7JD","DVU33",439.41250000000002,430.41250000000002,"IO85RL",null,null,"JEDBURGH","SCO",null,"DM DS NX ",null,null,"OPERATIONAL"]
[null,null,null,"GB7JF","DVU51",439.63749999999999,430.63749999999999,"IO92NE",null,null,"NORTHAMPTON","MID",null,"DS ",null,null,"OPERATIONAL"]
[null,null,null,"GB7JI","RU68",430.85,438.45,"IN89WE",null,null,"ST HELIER","SW",null,"DS ",null,null,"OPERATIONAL"]
[null,null,null,"GB7JM","RU71",430.88749999999999,438.48750000000001,"JO03BI",null,null,"ALFORD","MID",71.900000000000006,"A DM DS FU NX ",null,null,"OPERATIONAL"]
[null,null,null,"GB7JT","DVU54",439.67500000000001,430.67500000000001,"IO91",null,null,"LEIGHTON BUZZARD","SE",null,"DM FU ",null,null,"OPERATIONAL"]
[null,null,null,"GB7KB","RV52",145.65,145.05000000000001,"JO00CX",null,null,"HEATHFIELD","SE",null,"DM ",null,null,"OPERATIONAL"]
[null,null,null,"GB7KD","DVU55",439.6875,430.6875,"JO00DV",null,null,"HAILSHAM","SE",null,"DM ",null,null,"OPERATIONAL"]
[null,null,null,"GB7KE","DVU-R22",430.27499999999998,439.27499999999998,"JO01GJ",null,null,"CHATHAM ","SE",null,"DS FU ",null,null,"OPERATIONAL"]
[null,null,null,"GB7KK","RU74",430.92500000000001,438.52499999999998,"IO65VE",null,null,"BALLYCASTLE","NI",null,"DM DS FU ",null,null,"OPERATIONAL"]
[null,null,null,"GB7KL","RU70",430.875,438.47500000000002,"IO84RD",null,null,"KIRKBY LONSDALE","NOR",110.9,"A FU ",null,null,"NOT OPERATIONAL"]
[null,null,null,"GB7KN","DVU35",439.4375,430.4375,"IO85",null,null,"EDINBURGH","SCO",null,"DM DS FU ",null,null,"OPERATIONAL"]
[null,null,null,"GB7KP","DVU46",439.57499999999999,430.57499999999999,"IO74",null,null,"COMBER","NI",null,"DM DS FU ",null,null,"OPERATIONAL"]
[null,null,null,"GB7KR","DVU-R24",430.3,439.3,"IO82",null,null,"KIDDERMINSTER","MID",null,"DM ",null,null,"OPERATIONAL"]
[null,null,null,"GB7KS","DVU-R20",430.25,439.25,"IO81",null,null,"STROUD","SW",null,"DM ",null,null,"NOT OPERATIONAL"]
[null,null,null,"GB7KT","DVU40",439.5,430.5,"IO91GE",null,null,"ANDOVER","SW",null,"DM ",null,null,"OPERATIONAL"]
[null,null,null,"GB7KU","DVU42",439.52499999999998,430.52499999999998,"IO92TT",null,null,"BOURNE","EA",null,"DM DS FU ",null,null,"OPERATIONAL"]
[null,null,null,"GB7KY","DVU52",439.65,430.65,"IO86",null,null,"KIRKCALDY","SCO",103.5,"A DM DS FU NX ",null,null,"OPERATIONAL"]
[null,null,null,"GB7LA","DMU29",439.36250000000001,430.36250000000001,"IO84",null,null,"LANCASTER","NOR",null,"A DS FU ",null,null,"OPERATIONAL"]
[null,null,null,"GB7LB","DMU27",439.33749999999998,430.33749999999998,"IO75RX",null,null,"ALEXANDRIA","SCO",null,"DM ",null,null,"NOT OPERATIONAL"]
[null,null,null,"GB7LC","UR63",438.38749999999999,430.78750000000002,"IO93RE",null,null,"LINCOLN","MID",71.900000000000006,"A DM DS FU NX ",null,null,"REDUCED OUTPUT"]
[null,null,null,"GB7LD","DVU35",439.4375,430.4375,"IO83",null,null,"LEYLAND","NOR",null,"DM ",null,null,"OPERATIONAL"]
[null,null,null,"GB7LE","DVU53",439.66250000000002,430.66250000000002,"IO93FU",null,null,"LEEDS","NOR",null,"DM ",null,null,"OPERATIONAL"]
[null,null,null,"GB7LF","DVU43",439.53750000000002,430.53750000000002,"IO84OA",null,null,"LANCASTER","NOR",null,"DS ",null,null,"NOT OPERATIONAL"]
[null,null,null,"GB7LK","RU65",430.8125,438.41250000000002,"IO70SM",null,null,"LISKEARD","SW",null,"DM ",null,null,"NOT OPERATIONAL"]
[null,null,null,"GB7LN","DVU32",439.4,430.4,"IO93RF",null,null,"LINCOLN","MID",null,"DM ",null,null,"OPERATIONAL"]
[null,null,null,"GB7LO","DVU41",439.51249999999999,430.51249999999999,"IO91",null,null,"BECKENHAM","SE",null,"DM ",null,null,"OPERATIONAL"]
[null,null,null,"GB7LP","DVU32",439.4,430.4,"IO83MK",null,null,"LIVERPOOL","NOR",null,"DM ",null,null,"OPERATIONAL"]
[null,null,null,"GB7LR","DVU38",439.47500000000002,430.47500000000002,"IO92IQ",null,null,"LEICESTER","MID",null,"DM ",null,null,"OPERATIONAL"]
[null,null,null,"GB7LS","DVU32",439.4,430.4,"IO85",null,null,"GALASHIELS ","SCO",null,"DM DS FU ",null,null,"OPERATIONAL"]
[null,null,null,"GB7LT","U324",434.05,434.05,"IO92",null,null,"BOURNE","EA",null,"",null,null,"OPERATIONAL"]
[null,null,null,"GB7LV","RV49",145.61250000000001,145.01249999999999,"IO85FV",null,null,"LIVINGSTON","SCO",null,"A DM DS FU ",null,null,"OPERATIONAL"]
[null,null,null,"GB7LW","RV47",145.58750000000001,144.98750000000001,"IO80CH",null,null,"LODDISWELL","SW",null,"DM ",null,null,"NOT OPERATIONAL"]
[null,null,null,"GB7LZ","RU73",430.91250000000002,438.51249999999999,"IO80AU",null,null,"WINKLEIGH","SW",null,"DM ",null,null,"OPERATIONAL"]
[null,null,null,"GB7MA","DVU36",439.45,430.45,"IO75PI",null,null,"MAYBOLE","SCO",103.5,"FU ",null,null,"NOT OPERATIONAL"]
[null,null,null,"GB7MB","DVU56",439.7,430.7,"IO84",null,null,"MORECAMBE","NOR",null,"FU ",null,null,"OPERATIONAL"]
[null,null,null,"GB7MC","DVU43",439.53750000000002,430.53750000000002,"IO70",null,null,"ST AUSTELL","SW",null,"DS FU ",null,null,"OPERATIONAL"]
[null,null,null,"GB7MD","DVU32",439.4,430.4,"IO80UT",null,null,"BLANDFORD FORUM","SW",null,"FU ",null,null,"OPERATIONAL"]
[null,null,null,"GB7ME","DVU58",439.72500000000002,430.72500000000002,"IO92JJ",null,null,"RUGBY","MID",null,"DS ",null,null,"OPERATIONAL"]
[null,null,null,"GB7MF","DVU54",439.67500000000001,430.67500000000001,"IO64QR",null,null,"MAGHERAFELT","NI",null,"DM DS FU ",null,null,"OPERATIONAL"]
[null,null,null,"GB7MH","DVU51",439.63749999999999,430.63749999999999,"IO91WC",null,null,"EAST GRINSTEAD","SE",null,"DM DS FU ",null,null,"OPERATIONAL"]
[null,null,null,"GB7MJ","DVU51",439.63749999999999,430.63749999999999,"IO91GA",null,null,"ROMSEY","SW",null,"DM ",null,null,"OPERATIONAL"]
[null,null,null,"GB7MK","DVU48",439.6,430.6,"JO02OB",null,null,"IPSWICH","EA",null,"DM ",null,null,"OPERATIONAL"]
[null,null,null,"GB7MM","DVU60",439.75,430.75,"IO87BN",null,null,"NAIRN","SCO",null,"DM DS FU ",null,null,"OPERATIONAL"]
[null,null,null,"GB7MN","DVU33",439.41250000000002,430.41250000000002,"IO83",null,null,"STOCKPORT","NOR",null,"DM ",null,null,"OPERATIONAL"]
[null,null,null,"GB7MP","DVU60",439.75,430.75,"IO84NB",null,null,"HEYSHAM","NOR",null,"DM ",null,null,"OPERATIONAL"]
[null,null,null,"GB7MR","DVU59",439.73750000000001,430.73750000000001,"IO83",null,null,"BURY","NOR",null,"DM ",null,null,"OPERATIONAL"]
[null,null,null,"GB7MS","RV62",145.77500000000001,145.17500000000001,"IO94EX",null,null,"NEWCASTLE UPON TYNE","NOR",null,"DM ",null,null,"OPERATIONAL"]
[null,null,null,"GB7MT","DVU53",439.66250000000002,430.66250000000002,"IO90IV",null,null,"SOUTHAMPTON","SW",null,"FU ",null,null,"OPERATIONAL"]
[null,null,null,"GB7NA-B","DVU36",439.45,430.45,"IO93HN",null,null,"BARNSLEY","NOR",71.900000000000006,"A DS ",null,null,"OPERATIONAL"]
[null,null,null,"GB7NA-C","RV54",145.67500000000001,145.07499999999999,"IO93HN",null,null,"BARNSLEY","NOR",null,"A DS ",null,null,"OPERATIONAL"]
[null,null,null,"GB7NA-P","DVU36",439.45,430.45,"IO93SE",null,null,"BARNSLEY","NOR",71.900000000000006,"A ",null,null,"OPERATIONAL"]
[null,null,null,"GB7NB","DVU55",439.6875,430.6875,"JO02PN",null,null,"NORWICH","EA",null,"DS ",null,null,"OPERATIONAL"]
[null,null,null,"GB7ND","DVU33",439.41250000000002,430.41250000000002,"JO02LM",null,null,"GREAT ELLINGHAM","EA",null,"DM ",null,null,"OPERATIONAL"]
[null,null,null,"GB7NE","DVU36",439.45,430.45,"IO95FE",null,null,"ELLINGTON  MORPETH","NOR",null,"DM DS FU ",null,null,"OPERATIONAL"]
[null,null,null,"GB7NF","DVU39",439.48750000000001,430.48750000000001,"JO00AS",null,null,"NEWHAVEN","SE",null,"DM ",null,null,"OPERATIONAL"]
[null,null,null,"GB7NH","DVU50",439.625,430.625,"IO91OF",null,null,"ALDERSHOT","SW",null,"FU ",null,null,"OPERATIONAL"]
[null,null,null,"GB7NI","RU79",430.98750000000001,438.58749999999998,"IO92NG",null,null,"NORTHAMPTON","MID",77,"A FU ",null,null,"OPERATIONAL"]
[null,null,null,"GB7NL","DVU37",439.46249999999998,430.46249999999998,"IO80FR",null,null,"EXETER","SW",null,"DS ",null,null,"OPERATIONAL"]
[null,null,null,"GB7NM","RV59",145.73750000000001,145.13749999999999,"JO02LM",null,null,"ATTLEBOURGH","EA",null,"DS FU ",null,null,"OPERATIONAL"]
[null,null,null,"GB7NN","DVU60",439.75,430.75,"IO93",null,null,"WORKSOP","MID",null,"FU ",null,null,"OPERATIONAL"]
[null,null,null,"GB7NR","DVU35",439.4375,430.4375,"IO92KX",null,null,"NOTTINGHAM","MID",null,"DM DS ",null,null,"OPERATIONAL"]
[null,null,null,"GB7NS","DVU13",439.16250000000002,430.16250000000002,"IO91",null,null,"BANSTEAD  SURREY","SE",null,"DM ",null,null,"OPERATIONAL"]
[null,null,null,"GB7NT","RU74",430.92500000000001,438.52499999999998,"IO91IJ",null,null,"NEWBURY","SW",118.8,"A FU ",null,null,"OPERATIONAL"]
[null,null,null,"GB7NV","RU66",430.82499999999999,438.42500000000001,"IO93",null,null,"NOTTINGHAM","MID",null,"DM DS ",null,null,"OPERATIONAL"]
[null,null,null,"GB7NW","DVU58",439.72500000000002,430.72500000000002,"IO91DN",null,null,"SWINDON","SW",null,"FU ",null,null,"OPERATIONAL"]
[null,null,null,"GB7NX","UR63",438.38749999999999,430.78750000000002,"IO70",null,null,"NEAR HOLSWORTHY ","SW",77,"A DM DS FU ",null,null,"OPERATIONAL"]
[null,null,null,"GB7OK","RV57",145.71250000000001,145.11250000000001,"IO91",null,null,"BECKENHAM","SE",null,"DM DS FU ",null,null,"OPERATIONAL"]
[null,null,null,"GB7OR","DVU37",439.46249999999998,430.46249999999998,"IO88LX",null,null,"KIRKWALL","SCO",77,"A DM ",null,null,"OPERATIONAL"]
[null,null,null,"GB7PA","DVU42",439.52499999999998,430.52499999999998,"IO75",null,null,"PAISLEY","SCO",null,"DM ",null,null,"OPERATIONAL"]
[null,null,null,"GB7PB","RV53",145.66249999999999,145.0625,"IO94FR",null,null,"DURHAM","NOR",null,"DS ",null,null,"OPERATIONAL"]
[null,null,null,"GB7PC","RV48",145.6,145,"IO70IA",null,null,"MULLION","SW",null,"DM ",null,null,"OPERATIONAL"]
[null,null,null,"GB7PE","DVU40",439.5,430.5,"IO92TL",null,null,"PETERBOROUGH","EA",null,"DM ",null,null,"OPERATIONAL"]
[null,null,null,"GB7PF","DVU51",439.63749999999999,430.63749999999999,"IO80AN",null,null,"PRINCETOWN","SW",null,"DM ",null,null,"OPERATIONAL"]
[null,null,null,"GB7PH","DVU37",439.46249999999998,430.46249999999998,"JO00",null,null,"HAILSHAM","SE",null,"DM DS ",null,null,"OPERATIONAL"]
[null,null,null,"GB7PI","DVU61",439.76249999999999,430.76249999999999,"IO92XA",null,null,"ROYSTON","SE",null,"DS ",null,null,"OPERATIONAL"]
[null,null,null,"GB7PM","DVU35",439.4375,430.4375,"IO81PH",null,null,"CHARTERHOUSE","SW",null,"FU ",null,null,"NOT OPERATIONAL"]
[null,null,null,"GB7PN","DVU34",439.42500000000001,430.42500000000001,"IO83HH",null,null,"PRESTATYN","WM",null,"DM ",null,null,"OPERATIONAL"]
[null,null,null,"GB7PO","DVU59",439.73750000000001,430.73750000000001,"IO90KT",null,null,"PORTSMOUTH","SW",null,"FU ",null,null,"OPERATIONAL"]
[null,null,null,"GB7PR","U324",434.05,434.05,"IO83RU",null,null,"LONGRIDGE","NOR",null,"",null,null,"OPERATIONAL"]
[null,null,null,"GB7PS","RV55",145.6875,145.08750000000001,"IO90",null,null,"PORTSMOUTH","SW",null,"DM ",null,null,"NOT OPERATIONAL"]
[null,null,null,"GB7PT","DVU57",439.71249999999998,430.71249999999998,"IO92XA",null,null,"ROYSTON","SE",null,"DM DS FU ",null,null,"OPERATIONAL"]
[null,null,null,"GB7PU","DVU17A",439.21875,430.21875,"IO83",null,null,"PRESTON","NOR",null,"",null,null,"OPERATIONAL"]
[null,null,null,"GB7PW","U321A",434.01875000000001,434.01875000000001,"IO83RU",null,null,"PRESTON","NOR",null,"",null,null,"OPERATIONAL"]
[null,null,null,"GB7PX","DVU62",439.77499999999998,430.77499999999998,"IO92XA",null,null,"ROYSTON","SE",null,"DM DS ",null,null,"OPERATIONAL"]
[null,null,null,"GB7PY","RU74",430.92500000000001,438.52499999999998,"JO02AF",null,null,"CAMBRIDGE","EA",null,"DM ",null,null,"OPERATIONAL"]
[null,null,null,"GB7RA","DVU52",439.65,430.65,"IO83LH",null,null,"NESTON","NOR",null,"DM DS FU ",null,null,"OPERATIONAL"]
[null,null,null,"GB7RB-C","RV54",145.67500000000001,145.07499999999999,"IO81GK",null,null,"COWBRIDGE","WM",null,"DS ",null,null,"OPERATIONAL"]
[null,null,null,"GB7RC","DVU-R21",430.26249999999999,439.26249999999999,"IO81",null,null,"CHELTENHAM","SW",null,"DS ",null,null,"OPERATIONAL"]
[null,null,null,"GB7RD","DVU55",439.6875,430.6875,"IO70",null,null,"YELVERTON","SW",null,"DM ",null,null,"OPERATIONAL"]
[null,null,null,"GB7RE","DVU57",439.71249999999998,430.71249999999998,"IO93MH",null,null,"RETFORD","MID",null,"DM ",null,null,"OPERATIONAL"]
[null,null,null,"GB7RG","RU79",430.98750000000001,438.58749999999998,"IO74LV",null,null,"STRANRAER","SCO",103.5,"A DM ",null,null,"OPERATIONAL"]
[null,null,null,"GB7RH","DVU-R24",430.3,439.3,"JO00",null,null,"HEATHFIELD","SE",123,"A DM ",null,null,"REDUCED OUTPUT"]
[null,null,null,"GB7RJ","DVU43",439.53750000000002,430.53750000000002,"IO82LW",null,null,"CHIRK","MID",null,"DM DS ",null,null,"OPERATIONAL"]
[null,null,null,"GB7RK","DVU35",439.4375,430.4375,"IO74AN",null,null,"BELFAST","NI",110.9,"A ",null,null,"OPERATIONAL"]
[null,null,null,"GB7RL","DVU62",439.77499999999998,430.77499999999998,"IO83RU",null,null,"LONGRIDGE","NOR",null,"DM DS FU NX ",null,null,"OPERATIONAL"]
[null,null,null,"GB7RM","U324",434.05,434.05,"JO01CO",null,null,"ROMFORD","SE",null,"",null,null,"OPERATIONAL"]
[null,null,null,"GB7RN","RV51",145.63749999999999,145.03749999999999,"IO90JT",null,null,"FAREHAM","SW",null,"DS ",null,null,"OPERATIONAL"]
[null,null,null,"GB7RO","DVU-R21",430.26249999999999,439.26249999999999,"IO83UQ",null,null,"HASLINGDEN","NOR",null,"FU ",null,null,"OPERATIONAL"]
[null,null,null,"GB7RR","DVU49",439.61250000000001,430.61250000000001,"IO92",null,null,"KIMBERLEY","MID",null,"DM ",null,null,"OPERATIONAL"]
[null,null,null,"GB7RS","DVU49",439.61250000000001,430.61250000000001,"IO91PX",null,null,"MILTON KEYNES","SE",null,"DM ",null,null,"OPERATIONAL"]
[null,null,null,"GB7RT","DVU33",439.41250000000002,430.41250000000002,"IO91",null,null,"SUNNINGDALE","SW",null,"DM ",null,null,"OPERATIONAL"]
[null,null,null,"GB7RU","DVU-R20",430.25,439.25,"JO00",null,null,"EASTBOURNE","SE",123,"A DM ",null,null,"REDUCED OUTPUT"]
[null,null,null,"GB7RV","DVU50",439.625,430.625,"IO83",null,null,"BLACKBURN","NOR",null,"DM ",null,null,"OPERATIONAL"]
[null,null,null,"GB7RW","RV48",145.6,145,"IO94SO",null,null,"WHITBY","NOR",88.5,"A DS ",null,null,"OPERATIONAL"]
[null,null,null,"GB7RX","RV62",145.77500000000001,145.17500000000001,"JO00GU",null,null,"HASTINGS","SE",103.5,"A DM ",null,null,"OPERATIONAL"]
[null,null,null,"GB7SB","DVU53",439.66250000000002,430.66250000000002,"IO92",null,null,"BIRMINGHAM","MID",null,"DM ",null,null,"OPERATIONAL"]
[null,null,null,"GB7SC","DVU48",439.6,430.6,"IO99GI",null,null,"SHEFFIELD","NOR",null,"DS ",null,null,"OPERATIONAL"]
[null,null,null,"GB7SD","DVU33",439.41250000000002,430.41250000000002,"IO80SQ",null,null,"WEYMOUTH","SW",null,"DM ",null,null,"OPERATIONAL"]
[null,null,null,"GB7SE","DVU38",439.47500000000002,430.47500000000002,"JO01DM",null,null,"THURROCK","SE",null,"DM ",null,null,"OPERATIONAL"]
[null,null,null,"GB7SF-C","RV59",145.73750000000001,145.13749999999999,"IO93GK",null,null,"SHEFFIELD","NOR",null,"DS ",null,null,"OPERATIONAL"]
[null,null,null,"GB7SG","RV61",145.76249999999999,145.16249999999999,"IO83MK",null,null,"LIVERPOOL","NOR",null,"DM ",null,null,"OPERATIONAL"]
[null,null,null,"GB7SH","RU77",430.96249999999998,438.5625,"IO93GK",null,null,"SHEFFIELD","NOR",71.900000000000006,"A FU ",null,null,"OPERATIONAL"]
[null,null,null,"GB7SI","DVU61",439.76249999999999,430.76249999999999,"IO83",null,null,"LEEK","MID",null,"DM ",null,null,"OPERATIONAL"]
[null,null,null,"GB7SJ","RB07",433.17500000000001,434.77499999999998,"IO83RF",null,null,"NORTHWICH","NOR",103.5,"A ",null,null,"OPERATIONAL"]
[null,null,null,"GB7SK","DVU37",439.46249999999998,430.46249999999998,"IO92NO",null,null,"LEICESTER","MID",null,"DM ",null,null,"OPERATIONAL"]
[null,null,null,"GB7SL","DVU50",439.625,430.625,"IO92TR",null,null,"BASTON","EA",null,"DM ",null,null,"OPERATIONAL"]
[null,null,null,"GB7SM","DVU47",439.58749999999998,430.58749999999998,"IO86",null,null,"ST MONANS","SCO",103.5,"A DM DS FU NX ",null,null,"OPERATIONAL"]
[null,null,null,"GB7SN","DVU54",439.67500000000001,430.67500000000001,"IO93GH",null,null,"SHEFFIELD","NOR",null,"DM ",null,null,"OPERATIONAL"]
[null,null,null,"GB7SO","DVU42",439.52499999999998,430.52499999999998,"IO90KT",null,null,"GOSPORT","SW",null,"DM DS ",null,null,"OPERATIONAL"]
[null,null,null,"GB7SP","DVU60",439.75,430.75,"IO91CB",null,null,"SALISBURY","SW",null,"DM ",null,null,"OPERATIONAL"]
[null,null,null,"GB7SQ","DVU54",439.67500000000001,430.67500000000001,"IO85",null,null,"DALKEITH","SCO",null,"DM NX ",null,null,"OPERATIONAL"]
[null,null,null,"GB7SR","DVU51",439.63749999999999,430.63749999999999,"IO93GJ",null,null,"SHEFFIELD","NOR",null,"DM ",null,null,"OPERATIONAL"]
[null,null,null,"GB7SS","DVU47",439.58749999999998,430.58749999999998,"IO87HR",null,null,"LOSSIEMOUTH","SCO",null,"DM ",null,null,"OPERATIONAL"]
[null,null,null,"GB7ST","DVU36",439.45,430.45,"IO83",null,null,"STOKE ON TRENT","MID",null,"DM ",null,null,"OPERATIONAL"]
[null,null,null,"GB7SU","DVU36",439.45,430.45,"IO90IV",null,null,"SOUTHAMPTON","SW",null,"DM ",null,null,"OPERATIONAL"]
[null,null,null,"GB7SV","DVU47",439.58749999999998,430.58749999999998,"IO91",null,null,"HITCHIN","SE",82.5,"FU ",null,null,"OPERATIONAL"]
[null,null,null,"GB7SW","RV51",145.63749999999999,145.03749999999999,"IO81VL",null,null,"CHIPPENHAM","SW",null,"DS ",null,null,"OPERATIONAL"]
[null,null,null,"GB7TB","DVU17A",439.21875,430.21875,"IO92TR",null,null,"BASTON","EA",null,"",null,null,"OPERATIONAL"]
[null,null,null,"GB7TC","DVU42",439.52499999999998,430.52499999999998,"IO91DL",null,null,"SWINDON","SW",null,"DM ",null,null,"OPERATIONAL"]
[null,null,null,"GB7TD","DVU13",439.16250000000002,430.16250000000002,"IO93EP",null,null,"WAKEFIELD","NOR",null,"DM ",null,null,"OPERATIONAL"]
[null,null,null,"GB7TE","RV62",145.77500000000001,145.17500000000001,"JO01OT",null,null,"CLACTON ON SEA","EA",null,"DS ",null,null,"OPERATIONAL"]
[null,null,null,"GB7TF","DVU39",439.48750000000001,430.48750000000001,"IO91QT",null,null,"TRING","SE",null,"FU ",null,null,"OPERATIONAL"]
[null,null,null,"GB7TG","RU78",430.97500000000002,438.57499999999999,"IO80",null,null,"WEMBWORTHY","SW",118.8,"A DM ",null,null,"OPERATIONAL"]
[null,null,null,"GB7TH","DVU-R23",430.28750000000002,439.28750000000002,"JO01QJ",null,null,"MARGATE","SE",null,"DM ",null,null,"OPERATIONAL"]
[null,null,null,"GB7TM","DVU59",439.73750000000001,430.73750000000001,"JO02NH",null,null,"EYE","EA",null,"FU ",null,null,"OPERATIONAL"]
[null,null,null,"GB7TP","DVU55",439.6875,430.6875,"IO93CT",null,null,"SHIPLEY","NOR",null,"DM DS FU ",null,null,"OPERATIONAL"]
[null,null,null,"GB7TQ","RU71",430.88749999999999,438.48750000000001,"IO80FM",null,null,"TORQUAY","SW",94.8,"A FU ",null,null,"OPERATIONAL"]
[null,null,null,"GB7TR",null,434,0,"JO01D1",null,null,"NEW ASH GREEN","SE",null,"",null,null,"OPERATIONAL"]
[null,null,null,"GB7TX","U321A",434.01875000000001,434.01875000000001,"JO02TK",null,null,"BECCLES","EA",null,"",null,null,"OPERATIONAL"]
[null,null,null,"GB7TY","DVU49",439.61250000000001,430.61250000000001,"IO84XX",null,null,"HEXHAM","NOR",null,"DM DS ",null,null,"OPERATIONAL"]
[null,null,null,"GB7UL","DVU42",439.52499999999998,430.52499999999998,"IO74",null,null,"CARRICKFERGUS","NI",null,"DM ",null,null,"OPERATIONAL"]
[null,null,null,"GB7VD","DVU-R22",430.27499999999998,439.27499999999998,"IO81",null,null,"CHELTENHAM","SW",null,"DM ",null,null,"NOT OPERATIONAL"]
[null,null,null,"GB7VO","DVU56",439.7,430.7,"IO82QJ",null,null,"TENBURY WELLS","MID",null,"DM DS FU NX ",null,null,"OPERATIONAL"]
[null,null,null,"GB7VR","RV49",145.61250000000001,145.01249999999999,"IO91TU",null,null,"HARPENDEN","SE",82.5,"A FU ",null,null,"OPERATIONAL"]
[null,null,null,"GB7VT","U94",431.17500000000001,431.17500000000001,"IO83",null,null,"STOKE-ON-TRENT","MID",null,"DM ",null,null,"OPERATIONAL"]
[null,null,null,"GB7WB","DVU39",439.48750000000001,430.48750000000001,"IO81MH",null,null,"WESTON-SUPER-MARE","SW",null,"DM DS ",null,null,"OPERATIONAL"]
[null,null,null,"GB7WC","DVU39",439.48750000000001,430.48750000000001,"IO83QI",null,null,"WARRINGTON","NOR",null,"DS ",null,null,"OPERATIONAL"]
[null,null,null,"GB7WD","DVU57",439.71249999999998,430.71249999999998,"IO82",null,null,"SEDGLEY","MID",null,"DM ",null,null,"OPERATIONAL"]
[null,null,null,"GB7WE","DVU53",439.66250000000002,430.66250000000002,"JO01KE",null,null,"ASHFORD","SE",null,"DS ",null,null,"NOT OPERATIONAL"]
[null,null,null,"GB7WF","DVU39",439.48750000000001,430.48750000000001,"IO82",null,null,"BEWDLEY","MID",null,"DM DS FU NX ",null,null,"OPERATIONAL"]
[null,null,null,"GB7WH","DMU30",439.375,430.375,"IO83",null,null,"WREXHAM","WM",110.9,"A FU ",null,null,"OPERATIONAL"]
[null,null,null,"GB7WI","DVU33",439.41250000000002,430.41250000000002,"IO93SS",null,null,"COTTINGHAM","NOR",null,"DM ",null,null,"NOT OPERATIONAL"]
[null,null,null,"GB7WK","DVU41",439.51249999999999,430.51249999999999,"IO91",null,null,"WOKING","SW",null,"DM DS FU NX ",null,null,"OPERATIONAL"]
[null,null,null,"GB7WL","DVU37",439.46249999999998,430.46249999999998,"IO91QP",null,null,"AMERSHAM","SE",null,"DM ",null,null,"OPERATIONAL"]
[null,null,null,"GB7WM","DVU55",439.6875,430.6875,"IO83SM",null,null,"ASTLEY","NOR",null,"FU ",null,null,"OPERATIONAL"]
[null,null,null,"GB7WN","DVU60",439.75,430.75,"IO82XP",null,null,"WOLVERHAMPTON","MID",null,"DM ",null,null,"REDUCED OUTPUT"]
[null,null,null,"GB7WR","DVU37",439.46249999999998,430.46249999999998,"IO82UB",null,null,"GREAT MALVERN","MID",null,"DS ",null,null,"OPERATIONAL"]
[null,null,null,"GB7WS","DVU34",439.42500000000001,430.42500000000001,"IO91SA",null,null,"BILLINGSHURST","SE",null,"DM ",null,null,"OPERATIONAL"]
[null,null,null,"GB7WT","DVU48",439.6,430.6,"IO64HQ",null,null,"OMAGH","NI",null,"DM DS FU ",null,null,"OPERATIONAL"]
[null,null,null,"GB7WV","DVU55",439.6875,430.6875,"IO92NL",null,null,"MARKET HARBOROUGH","MID",null,"DM ",null,null,"OPERATIONAL"]
[null,null,null,"GB7WW","DVU38",439.47500000000002,430.47500000000002,"IO81",null,null,"KINGTON LANGLEY","SW",null,"DM ",null,null,"OPERATIONAL"]
[null,null,null,"GB7WX","DVU41",439.51249999999999,430.51249999999999,"IO83OE",null,null,"TARVIN","NOR",null,"DM DS FU ",null,null,"OPERATIONAL"]
[null,null,null,"GB7WY","DVU41",439.51249999999999,430.51249999999999,"IO93FR",null,null,"WAKEFIELD","NOR",82.5,"A FU ",null,null,"OPERATIONAL"]
[null,null,null,"GB7XF","DVU-R20",430.25,439.25,"IO83XM",null,null,"ASHTON-UNDER-LYNE","NOR",82.5,"A DM ",null,null,"NOT OPERATIONAL"]
[null,null,null,"GB7XG","RU70",430.875,438.47500000000002,"IO86",null,null,"GLENROTHES ","SCO",103.5,"A DM DS FU NX ",null,null,"OPERATIONAL"]
[null,null,null,"GB7XN","DVU45",439.5625,430.5625,"IO93KH",null,null,"WORKSOP","MID",null,"DM DS FU ",null,null,"OPERATIONAL"]
[null,null,null,"GB7XX","DVU37",439.46249999999998,430.46249999999998,"IO94",null,null,"FELLING","NOR",118.8,"A DM ",null,null,"OPERATIONAL"]
[null,null,null,"GB7XY","DVU34",439.42500000000001,430.42500000000001,"IO94EX",null,null,"NEWCASTLE UPON TYNE","NOR",null,"DM ",null,null,"OPERATIONAL"]
[null,null,null,"GB7YD","DVU55",439.6875,430.6875,"IO80PW",null,null,"YEOVIL","SW",null,"DM ",null,null,"NOT OPERATIONAL"]
[null,null,null,"GB7YI","DVU46",439.57499999999999,430.57499999999999,"IO84WX",null,null,"HEXHAM","NOR",null,"DM ",null,null,"OPERATIONAL"]
[null,null,null,"GB7YJ","DVU47",439.58749999999998,430.58749999999998,"IO92FH",null,null,"LEAMINGTON SPA","MID",null,"DM ",null,null,"OPERATIONAL"]
[null,null,null,"GB7YL","RV63",145.78749999999999,145.1875,"JO02UL",null,null,"LOWESTOFT","EA",null,"A DM DS ",null,null,"OPERATIONAL"]
[null,null,null,"GB7YM","DVU57",439.71249999999998,430.71249999999998,"IO80",null,null,"TORQUAY","SW",null,"DM ",null,null,"OPERATIONAL"]
[null,null,null,"GB7YN","DVU-R23",430.28750000000002,439.28750000000002,"IO93HO",null,null,"WAKEFIELD","NOR",null,"DM ",null,null,"OPERATIONAL"]
[null,null,null,"GB7YR","DVU42",439.52499999999998,430.52499999999998,"IO93",null,null,"DONCASTER","NOR",null,"DM ",null,null,"OPERATIONAL"]
[null,null,null,"GB7YS","RU79",430.98750000000001,438.58749999999998,"IO83",null,null,"SOUTHPORT","NOR",67,"A FU ",null,null,"NOT OPERATIONAL"]
[null,null,null,"GB7YY","DVU34",439.42500000000001,430.42500000000001,"IO81QJ",null,null,"DUNDRY","SW",null,"DM DS FU NX ",null,null,"OPERATIONAL"]
[null,null,null,"GB7YZ","DVU38",439.47500000000002,430.47500000000002,"IO83JE",null,null,"MOLD","WM",null,"DM FU ",null,null,"OPERATIONAL"]
[null,null,null,"GB7ZE","RB02",433.05,434.65,"JO00GU",null,null,"HASTINGS","SE",103.5,"A DM ",null,null,"OPERATIONAL"]
[null,null,null,"GB7ZP","DVU39",439.48750000000001,430.48750000000001,"JO01FS",null,null,"CHELMSFORD","EA",110.9,"A DS ",null,null,"OPERATIONAL"]
[null,null,null,"GB7ZT","DVU32",439.4,430.4,"IO75LC",null,null,"BALLANTRAE","SCO",null,"DM ",null,null,"OPERATIONAL"]
[null,null,null,"GW7VFJ","DVU12",439.15,430.15,"IO83JF",null,null,"HOLYWELL","WM",110.9,"A ",null,null,"OPERATIONAL"]
[null,null,null,"GW8IOA","RU77",430.96249999999998,438.5625,"IO81MN",null,null,"NEWPORT","WM",88.5,"A ",null,null,"NOT OPERATIONAL"]
[null,null,null,"M0IDL","RU67",430.83749999999998,438.4375,"IO90AR",null,null,"POOLE","SW",71.900000000000006,"A ",null,null,"OPERATIONAL"]
[null,null,null,"M0JXR","DVU12",439.15,430.15,"IO81PL",null,null,"BRISTOL","SW",110.9,"A DM ",null,null,"OPERATIONAL"]
[null,null,null,"M0OFF","DVU12",439.15,430.15,"IO92VI",null,null,"HUNTINGDON","EA",94.8,"A NX ",null,null,"OPERATIONAL"]
[null,null,null,"M0RQD","RU79",430.98750000000001,438.58749999999998,"IO90JP",null,null,"SANDOWN","SW",71.900000000000006,"A ",null,null,"OPERATIONAL"]
[null,null,null,"M0WTV","RV48",145.6,145,"IO83",null,null,"WINTER HILL  LANCS","NOR",null,"DS ",null,null,"OPERATIONAL"]
[null,null,null,"M1CMN","DVU41",439.51249999999999,430.51249999999999,"JO01",null,null,"FOLKESTONE","SE",103.5,"A ",null,null,"OPERATIONAL"]
[null,null,null,"MB5BW","RV47",145.58750000000001,144.98750000000001,"IO93HP",null,null,"WAKEFIELD","NOR",82.5,"DM ",null,null,"OPERATIONAL"]
[null,null,null,"MB5CR","RU66",430.82499999999999,438.42500000000001,"JO02PW",null,null,"CROMER","EA",94.8,"A ",null,null,"OPERATIONAL"]
[null,null,null,"MB5DS","RU74",430.92500000000001,438.52499999999998,"JO03DH",null,null,"MABLETHORPE","MID",82.5,"A DM DS FU ",null,null,"NOT OPERATIONAL"]
[null,null,null,"MB5DV",null,432.8,144.97499999999999,"IO93",null,null,"KIPPAX","NOR",null,"DM ",null,null,"NOT OPERATIONAL"]
[null,null,null,"MB5HM","RU70",430.875,438.47500000000002,"IO93",null,null,"BELPER","MID",71.900000000000006,"A ",null,null,"OPERATIONAL"]
[null,null,null,"MB5HR","RU71",430.88749999999999,438.48750000000001,"IO83JF",null,null,"MOLD","WM",110.9,"A ",null,null,"OPERATIONAL"]
[null,null,null,"MB5KT","DVU-R24",430.3,439.3,"IO93AU",null,null,"KEIGHLEY","NOR",null,"DM DS ",null,null,"OPERATIONAL"]
[null,null,null,"MB5NF","RU75",430.9375,438.53750000000002,"JO02",null,null,"AYLSHAM","EA",94.8,"A ",null,null,"NOT OPERATIONAL"]
[null,null,null,"MB5NG","RV46",145.57499999999999,144.97499999999999,"JO02",null,null,"AYLSHAM","EA",94.8,"A ",null,null,"NOT OPERATIONAL"]
[null,null,null,"MB5NN",null,432.8,144.5625,"JO02",null,null,"FRETTENHAM","EA",94.8,"A ",null,null,"OPERATIONAL"]
[null,null,null,"MB5SX","RU75",430.9375,438.53750000000002,"IO93FO",null,null,"BARNSLEY","NOR",71.900000000000006,"A DM DS FU ",null,null,"NOT OPERATIONAL"]
[null,null,null,"MB5TH","RV59",145.73750000000001,145.13749999999999,"IO87TG",null,null,"THAINSTONE","SCO",69.3,"A DM DS FU ",null,null,"NOT OPERATIONAL"]
[null,null,null,"MB5WP","R50-05",50.76,51.26,"IO93HP",null,null,"WAKEFIELD","NOR",82.5,"A ",null,null,"OPERATIONAL"]
[null,null,null,"MB5YN","DVU43",439.53750000000002,430.53750000000002,"IO93HP",null,null,"WAKEFIELD","NOR",null,"DS ",null,null,"NOT OPERATIONAL"]
[null,null,null,"MB7AM","4M",70.260000000000005,70.260000000000005,"IO91QP",null,null,"AMERSHAM","SW",null,"A ",null,null,"OPERATIONAL"]
[null,null,null,"MB7PM",null,29.61,29.61,"IO83SM",null,null,"ASTLEY","NOR",82.5,"A ",null,null,"NOT OPERATIONAL"]
[null,null,null,null,null,null,null,null,null,null,null,null,null,""]
[null,null,null,null,null,null,null,null,null,null,null,null,null,""]
[null,null,null,null,null,null,null,null,null,null,null,null,null,""]
[null,null,null,null,null,null,null,null,null,null,null,null,null,""]
[null,null,null,null,null,null,null,null,null,null,null,null,null,""]
[null,null,null,null,null,null,null,null,null,null,null,null,null,""]
[null,null,null,null,null,null,null,null,null,null,null,null,null,""]
[null,null,null,null,null,null,null,null,null,null,null,null,null,""]
[null,null,null,null,null,null,null,null,null,null,null,null,null,""]
[null,null,null,null,null,null,null,null,null,null,null,null,null,""]
[null,null,null,null,null,null,null,null,null,null,null,null,null,""]
[null,null,null,null,null,null,null,null,null,null,null,null,null,""]
[null,null,null,null,null,null,null,null,null,null,null,null,null,""]
[null,null,null,null,null,null,null,null,null,null,null,null,null,""]
[null,null,null,null,null,null,null,null,null,null,null,null,null,""]
[null,null,null,null,null,null,null,null,null,null,null,null,null,""]
[null,null,null,null,null,null,null,null,null,null,null,null,null,""]
[null,null,null,null,null,null,null,null,null,null,null,null,null,""]
[null,null,null,null,null,null,null,null,null,null,null,null,null,""]
[null,null,null,null,null,null,null,null,null,null,null,null,null,""]
[null,null,null,null,null,null,null,null,null,null,null,null,null,""]
[null,null,null,null,null,null,null,null,null,null,null,null,null,""]
[null,null,null,null,null,null,null,null,null,null,"","","",""]

{"sheet":"Temp","index":2,"n_rows":453,"n_cols":16,"rows_kept":453,"cut":false,"hidden":false,"merged":[[1,8,2,11],[4,8,4,11]]}
[]
[null,null,null,null,null,null,null,null,"This Sheets controls the Town Lists , To Update The Town List Use The Button"]
[]
[]
[null,null,null,null,null,null,null,null,"DO NOT ADJUST THESE LISTS MANUALLY"]
[]
[]
[null,null,null,"Column1","Column2","Column3",null,null,"MID","NI","NOR","SCO","SE","SW","WM","EA"]
[null,null,null,"HAVERHILL","HAVERHILL","EA",null,null,"STOKE-ON-TRENT","FERMANAGH","ASHINGTON","ABERDEEN","EPSOM","WESTON SUPER MARE","AMLWCH","HAVERHILL"]
[null,null,null,"EAST DEREHAM","EAST DEREHAM","EA",null,null,"ERDINGTON","DERRY/LONDONDERRY","SHEFFIELD","ARISAIG","SURREY","GOSPORT","CAERNARFON","EAST DEREHAM"]
[null,null,null,"BRAINTREE","BRAINTREE","EA",null,null,"STOURBRIDGE","BALLYCASTLE","WAKEFIELD","HAWICK","LEWES","SHIPHAM","BRECON","BRAINTREE"]
[null,null,null,"COLCHESTER","COLCHESTER","EA",null,null,"SCUNTHORPE","LIMAVADY","CHORLEY","ANGUS","CHESHAM","BRISTOL","PONTYPRIDD","COLCHESTER"]
[null,null,null,"CLACTON","CLACTON","EA",null,null,"KINGSWINFORD","MAGHERAFELT","CARLISLE","LANGHOLM","AMERSHAM","NEWBURY","CARMARTHEN","CLACTON"]
[null,null,null,"DANBURY","DANBURY","EA",null,null,"DUDLEY","BELFAST  N.I.","CROOK","DALRY","AYLESBURY","BASINGSTOKE","NEWCASTLE EMLYN","DANBURY"]
[null,null,null,"IPSWICH","IPSWICH","EA",null,null,"BIRMINGHAM","OMAGH","MARYPORT","DUNS","BEDFORD","BANBURY","CAERGWRLE","IPSWICH"]
[null,null,null,"DISS","DISS","EA",null,null,"CLEOBURY NORTH","BELFAST","YORK","MUIR OF ORD","BEXHILL-ON-SEA","CHULMLEIGH","LLANDUDNO","DISS"]
[null,null,null,"BASTON","BASTON","EA",null,null,"MARKFIELD","COLERAINE","UPPER DENBY","BERWICK ON TWEED","BROMLEY","BRACKNELL","LLANGOLLEN","BASTON"]
[null,null,null,"BURY ST EDMUNDS ","BURY ST EDMUNDS ","EA",null,null,"CORBY","DUNGIVEN","WARRINGTON","MOTHERWELL","HEMEL HEMPSTEAD ","BUDE","MERTHYR","BURY ST EDMUNDS "]
[null,null,null,"SUFFOLK","SUFFOLK","EA",null,null,"BOZEAT","TANDRAGEE","WIGAN","DUNDEE","HOVE","GLOUCESTER","LLANFAIR CAEREINION","SUFFOLK"]
[null,null,null,"ELY","ELY","EA",null,null,"COVENTRY","LISBURN","DUFTON","NEWTON STEWART","HEMEL HEMPSTEAD","LISKEARD","PRESTATYN","ELY"]
[null,null,null,"ASGARBY","ASGARBY","EA",null,null,"DERBY","COMBER","BLACKPOOL","PETERHEAD","CHICHESTER","FAREHAM","PWLLHELI","ASGARBY"]
[null,null,null,"SPILSBY LINCS.","SPILSBY LINCS.","EA",null,null,"WORKSOP","CARRICKFERGUS","SNAEFELL IOM","DUMBARTON","CHARING KENT","DIDCOT","NEWTOWN","SPILSBY LINCS."]
[null,null,null,"NR EYE","NR EYE","EA",null,null,"WIRKSWORTH",null,"HEXHAM","DUNS ","WORTHING","STIBB CROSS","LLANDRINDOD WELLS","NR EYE"]
[null,null,null,"GREAT YARMOUTH ","GREAT YARMOUTH ","EA",null,null,"MANSFIELD",null,"HUDDERSFIELD","EDINBURGH","NEWHAVEN","POLPERRO","SWANSEA","GREAT YARMOUTH "]
[null,null,null,"KINGS LYNN","KINGS LYNN","EA",null,null,"COLD ASHBY",null,"THIRSK","LOCHMADDY","MARGATE","WEYMOUTH","PEMBROKE","KINGS LYNN"]
[null,null,null,"NORWICH","NORWICH","EA",null,null,"NOTTINGHAM",null,"HARROGATE","STIRLING","HASTINGS","BLANDFORD","TONDU  BRIDGEND","NORWICH"]
[null,null,null,"WELLS NORFOLK","WELLS NORFOLK","EA",null,null,"SUTTON COLDFIELD",null,"HULL","UPPER LARGO","FOLKESTONE","ILMINSTER","WREXHAM","WELLS NORFOLK"]
[null,null,null,"GRAVELEY","GRAVELEY","EA",null,null,"GREAT MALVERN",null,"DOUGLAS  IOM","GLASGOW","HORSHAM","EXETER","FISHGUARD","GRAVELEY"]
[null,null,null,"PETERBOROUGH","PETERBOROUGH","EA",null,null,"GRANTHAM",null,"PEEL","BANCHORY","HARROW","SILVERTON","PORT TALBOT","PETERBOROUGH"]
[null,null,null,"SKEGNESS","SKEGNESS","EA",null,null,"HEREFORD",null,"RAMSEY  IOM","ISLE OF MULL","GIDEA PARK","SOMERSET","CWMBRAN","SKEGNESS"]
[null,null,null,"CLACTON ON SEA","CLACTON ON SEA","EA",null,null,"BUXTON",null,"RICHMOND YORKS","SELKIRK","HAYWARDS HEATH","CHEDDAR","NEWTOWN POWYS","CLACTON ON SEA"]
[null,null,null,"WYMONDHAM","WYMONDHAM","EA",null,null,"BELPER",null,"KEIGHLEY","LESLIE","ROCHESTER","FARNHAM","CARDIFF","WYMONDHAM"]
[null,null,null,"WISBECH","WISBECH","EA",null,null,"LUDLOW",null,"ASHTON-UNDER-LYNE","STORNOWAY","ERITH","NORTHLEACH","TREFFGARNE","WISBECH"]
[null,null,null,"LOWESTOFT","LOWESTOFT","EA",null,null,"HOOTON  WIRRAL",null,"LANCASTER","ISLE OF SOUTH UIST","CHATHAM ","GUILDFORD","COWBRIDGE","LOWESTOFT"]
[null,null,null,"BECCLES","BECCLES","EA",null,null,"HINCKLEY",null,"KENDAL","KILSYTH","HERNE BAY","ST HELIER",null,"BECCLES"]
[null,null,null,"GREAT CLACTON","GREAT CLACTON","EA",null,null,"WOLVERHAMPTON",null,"LIVERPOOL","SANQUHAR","MAIDSTONE","GUERNSEY",null,"GREAT CLACTON"]
[null,null,null,"BURY ST EDMUNDS","BURY ST EDMUNDS","EA",null,null,"TANSLEY NR MATLOCK",null,"ATHERTON","LAUDER","DOVER","ROCHE",null,"BURY ST EDMUNDS"]
[null,null,null,"DOWNHAM MARKET","DOWNHAM MARKET","EA",null,null,"KIDDERMINSTER",null,"LEASOWE","LERWICK","LONDON","LONG ASHTON  BRISTOL",null,"DOWNHAM MARKET"]
[null,null,null,"BOURNE","BOURNE","EA",null,null,"STOURPORT ON SEVERN",null,"MANCHESTER","FRASERBURGH","LUTON","NEWPORT",null,"BOURNE"]
[null,null,null,"GREAT ELLINGHAM","GREAT ELLINGHAM","EA",null,null,"LOUTH",null,"DISLEY","KIRKWALL","NORTH LONDON","MERE WILTSHIRE",null,"GREAT ELLINGHAM"]
[null,null,null,"ATTLEBOURGH","ATTLEBOURGH","EA",null,null,"SHREWSBURY",null,"MORECAMBE","LINLITHGOW","EAST GRINSTEAD","TIVERTON",null,"ATTLEBOURGH"]
[null,null,null,"EYE","EYE","EA",null,null,"LINCOLN",null,"STOCKPORT","PAISLEY","MILTON KEYNES","EASTLEIGH",null,"EYE"]
[null,null,null,"STOKE-ON-TRENT","STOKE-ON-TRENT","MID",null,null,"LEICESTER",null,"BARNSLEY","PERTH","STAINES UPON THAMES","WINKLEIGH"]
[null,null,null,"ERDINGTON","ERDINGTON","MID",null,null,"RUGBY",null,"NEWCASTLE UPON TYNE","ELGIN MORAY","BANSTEAD","NEAR HOLSWORTHY"]
[null,null,null,"STOURBRIDGE","STOURBRIDGE","MID",null,null,"MALVERN ",null,"SOUTHPORT","LARGS","BUCKHURST HILL","PORTSMOUTH"]
[null,null,null,"SCUNTHORPE","SCUNTHORPE","MID",null,null,"LEAMINGTON SPA",null,"ACCRINGTON","FORFAR","ROYSTON","WIMBORNE"]
[null,null,null,"KINGSWINFORD","KINGSWINFORD","MID",null,null,"NORTHAMPTON",null,"PRESTON","KILMARNOCK","BARKWAY","FARNBOROUGH"]
[null,null,null,"DUDLEY","DUDLEY","MID",null,null,"TOWCESTER",null,"PRESCO","BANFF","CAMBRIDGE","PLYMPTON"]
[null,null,null,"BIRMINGHAM","BIRMINGHAM","MID",null,null,"BOLSOVER",null,"DUKINFIELD","BATHGATE","RUSTINGTON","CHELTENHAM"]
[null,null,null,"CLEOBURY NORTH","CLEOBURY NORTH","MID",null,null,"BURTON-UPON-TRENT",null,"HASLINGDEN","KIRRIEMUIR","CANTERBURY","READING"]
[null,null,null,"MARKFIELD","MARKFIELD","MID",null,null,"STOKE ON TRENT",null,"RICHMOND NORTH YORKSHIRE","AIRDRIE","TRING","AXMINSTER"]
[null,null,null,"CORBY","CORBY","MID",null,null,"STAFFORD",null,"NORTHWICH","DUNBAR","BRILL","STROUD"]
[null,null,null,"BOZEAT","BOZEAT","MID",null,null,"TELFORD",null,"WITHERNSEA","KENNOWAY  FIFE","WELWYN GARDEN CITY","SOUTHAMPTON"]
[null,null,null,"COVENTRY","COVENTRY","MID",null,null,"TAMWORTH",null,"SHIPLEY","PORTPATRICK","HARPENDEN","HELSTON"]
[null,null,null,"DERBY","DERBY","MID",null,null,"TENBURY WELLS",null,"SUNDERLAND","STRANRAER","STEVENAGE OLD TOWN","ALTON HANTS"]
[null,null,null,"WORKSOP","WORKSOP","MID",null,null,"WYTHALL",null,"GATESHEAD","MONIFIETH","MORDEN","SIDMOUTH"]
[null,null,null,"WIRKSWORTH","WIRKSWORTH","MID",null,null,"LONGBRIDGE",null,"OTLEY","ERSKINE","EASTBOURNE","SWINDON"]
[null,null,null,"MANSFIELD","MANSFIELD","MID",null,null,"DAVENTRY",null,"LEEDS","LADYBANK","NEW ASH GREEN","TORQUAY"]
[null,null,null,"COLD ASHBY","COLD ASHBY","MID",null,null,"HUCKNALL",null,"WHITEHAVEN","PRESTONPANS","ASHFORD","BATH AVON"]
[null,null,null,"NOTTINGHAM","NOTTINGHAM","MID",null,null,"MALVERN",null,"DENTON","GALASHIELS","BRIGHTON","TRULL"]
[null,null,null,"SUTTON COLDFIELD","SUTTON COLDFIELD","MID",null,null,"CANNOCK",null,"FILEY","KEITH","WOBURN SANDS","WESTON-SUPER-MARE"]
[null,null,null,"GREAT MALVERN","GREAT MALVERN","MID",null,null,"CONGLETON",null,"CLECKHEATON","DUMFRIES","NEW ROMNEY","IVYBRIDGE"]
[null,null,null,"GRANTHAM","GRANTHAM","MID",null,null,"CASTLE BROMWICH",null,"HEBBURN","PRESTONPANS ","SOUTHEND ON SEA","CLANFIELD"]
[null,null,null,"HEREFORD","HEREFORD","MID",null,null,"BILSTON",null,"BRADFORD","INVERNESS","CHATHAM","MILTON ABBAS"]
[null,null,null,"BUXTON","BUXTON","MID",null,null,"CLEE HILL",null,"ALLENDALE","JEDBURGH","HIGH WYCOMBE","SLOUGH"]
[null,null,null,"BELPER","BELPER","MID",null,null,"HUTHWAITE",null,"RAMSEY IOM","KIRKCALDY","ROMFORD","WINCHESTER"]
[null,null,null,"LUDLOW","LUDLOW","MID",null,null,"ALFORD",null,"WAKEFIELD ","ALEXANDRIA","HEATHROW","POOLE"]
[null,null,null,"HOOTON  WIRRAL","HOOTON  WIRRAL","MID",null,null,"RETFORD",null,"DOUGLAS","GALASHIELS ","WESTCLIFF ON SEA","BIDEFORD"]
[null,null,null,"HINCKLEY","HINCKLEY","MID",null,null,"CHIRK",null,"DONCASTER","LIVINGSTON","LEIGHTON BUZZARD","AXBRIDGE"]
[null,null,null,"WOLVERHAMPTON","WOLVERHAMPTON","MID",null,null,"KIMBERLEY",null,"NELSON","MAYBOLE","HEATHFIELD","BARNHAM"]
[null,null,null,"TANSLEY NR MATLOCK","TANSLEY NR MATLOCK","MID",null,null,"LEEK",null,"CLEVELEYS","NAIRN","HAILSHAM","CHURCHDOWN"]
[null,null,null,"KIDDERMINSTER","KIDDERMINSTER","MID",null,null,"SEDGLEY",null,"FRECKLETON","ST MONANS","BECKENHAM","ST. PETER PORT"]
[null,null,null,"STOURPORT ON SEVERN","STOURPORT ON SEVERN","MID",null,null,"BEWDLEY",null,"WASHINGTON","DALKEITH","BANSTEAD  SURREY","TAVISTOCK"]
[null,null,null,"LOUTH","LOUTH","MID",null,null,"MARKET HARBOROUGH",null,"LEIGH","LOSSIEMOUTH","THURROCK","NEWTON ABBOT"]
[null,null,null,"SHREWSBURY","SHREWSBURY","MID",null,null,null,null,"HEPTONSTALL","GLENROTHES ","HITCHIN","PLYMOUTH"]
[null,null,null,"LINCOLN","LINCOLN","MID",null,null,null,null,"SOUTH CAVE",null,"BILLINGSHURST","LIVERTON"]
[null,null,null,"LEICESTER","LEICESTER","MID",null,null,null,null,"HORWICH",null,null,"MERE  WILTSHIRE"]
[null,null,null,"RUGBY","RUGBY","MID",null,null,null,null,"KIRKBY LONSDALE",null,null,"WINCANTON"]
[null,null,null,"MALVERN ","MALVERN ","MID",null,null,null,null,"LEYLAND",null,null,"ANDOVER"]
[null,null,null,"LEAMINGTON SPA","LEAMINGTON SPA","MID",null,null,null,null,"HEYSHAM",null,null,"LODDISWELL"]
[null,null,null,"NORTHAMPTON","NORTHAMPTON","MID",null,null,null,null,"BURY",null,null,"ST AUSTELL"]
[null,null,null,"TOWCESTER","TOWCESTER","MID",null,null,null,null,"ELLINGTON  MORPETH",null,null,"BLANDFORD FORUM"]
[null,null,null,"BOLSOVER","BOLSOVER","MID",null,null,null,null,"DURHAM",null,null,"ROMSEY"]
[null,null,null,"BURTON-UPON-TRENT","BURTON-UPON-TRENT","MID",null,null,null,null,"LONGRIDGE",null,null,"ALDERSHOT"]
[null,null,null,"STOKE ON TRENT","STOKE ON TRENT","MID",null,null,null,null,"NESTON",null,null,"NEAR HOLSWORTHY "]
[null,null,null,"STAFFORD","STAFFORD","MID",null,null,null,null,"BLACKBURN",null,null,"MULLION"]
[null,null,null,"TELFORD","TELFORD","MID",null,null,null,null,"WHITBY",null,null,"PRINCETOWN"]
[null,null,null,"TAMWORTH","TAMWORTH","MID",null,null,null,null,"COTTINGHAM",null,null,"CHARTERHOUSE"]
[null,null,null,"TENBURY WELLS","TENBURY WELLS","MID",null,null,null,null,"ASTLEY",null,null,"YELVERTON"]
[null,null,null,"WYTHALL","WYTHALL","MID",null,null,null,null,"TARVIN",null,null,"SUNNINGDALE"]
[null,null,null,"LONGBRIDGE","LONGBRIDGE","MID",null,null,null,null,"FELLING",null,null,"SALISBURY"]
[null,null,null,"DAVENTRY","DAVENTRY","MID",null,null,null,null,null,null,null,"CHIPPENHAM"]
[null,null,null,"HUCKNALL","HUCKNALL","MID",null,null,null,null,null,null,null,"WEMBWORTHY"]
[null,null,null,"MALVERN","MALVERN","MID",null,null,null,null,null,null,null,"WOKING"]
[null,null,null,"CANNOCK","CANNOCK","MID",null,null,null,null,null,null,null,"KINGTON LANGLEY"]
[null,null,null,"CONGLETON","CONGLETON","MID"]
[null,null,null,"CASTLE BROMWICH","CASTLE BROMWICH","MID"]
[null,null,null,"BILSTON","BILSTON","MID"]
[null,null,null,"CLEE HILL","CLEE HILL","MID"]
[null,null,null,"HUTHWAITE","HUTHWAITE","MID"]
[null,null,null,"ALFORD","ALFORD","MID"]
[null,null,null,"RETFORD","RETFORD","MID"]
[null,null,null,"CHIRK","CHIRK","MID"]
[null,null,null,"KIMBERLEY","KIMBERLEY","MID"]
[null,null,null,"LEEK","LEEK","MID"]
[null,null,null,"SEDGLEY","SEDGLEY","MID"]
[null,null,null,"BEWDLEY","BEWDLEY","MID"]
[null,null,null,"MARKET HARBOROUGH","MARKET HARBOROUGH","MID"]
[null,null,null,"FERMANAGH","FERMANAGH","NI"]
[null,null,null,"DERRY/LONDONDERRY","DERRY/LONDONDERRY","NI"]
[null,null,null,"BALLYCASTLE","BALLYCASTLE","NI"]
[null,null,null,"LIMAVADY","LIMAVADY","NI"]
[null,null,null,"MAGHERAFELT","MAGHERAFELT","NI"]
[null,null,null,"BELFAST  N.I.","BELFAST  N.I.","NI"]
[null,null,null,"OMAGH","OMAGH","NI"]
[null,null,null,"BELFAST","BELFAST","NI"]
[null,null,null,"COLERAINE","COLERAINE","NI"]
[null,null,null,"DUNGIVEN","DUNGIVEN","NI"]
[null,null,null,"TANDRAGEE","TANDRAGEE","NI"]
[null,null,null,"LISBURN","LISBURN","NI"]
[null,null,null,"COMBER","COMBER","NI"]
[null,null,null,"CARRICKFERGUS","CARRICKFERGUS","NI"]
[null,null,null,"ASHINGTON","ASHINGTON","NOR"]
[null,null,null,"SHEFFIELD","SHEFFIELD","NOR"]
[null,null,null,"WAKEFIELD","WAKEFIELD","NOR"]
[null,null,null,"CHORLEY","CHORLEY","NOR"]
[null,null,null,"CARLISLE","CARLISLE","NOR"]
[null,null,null,"CROOK","CROOK","NOR"]
[null,null,null,"MARYPORT","MARYPORT","NOR"]
[null,null,null,"YORK","YORK","NOR"]
[null,null,null,"UPPER DENBY","UPPER DENBY","NOR"]
[null,null,null,"WARRINGTON","WARRINGTON","NOR"]
[null,null,null,"WIGAN","WIGAN","NOR"]
[null,null,null,"DUFTON","DUFTON","NOR"]
[null,null,null,"BLACKPOOL","BLACKPOOL","NOR"]
[null,null,null,"SNAEFELL IOM","SNAEFELL IOM","NOR"]
[null,null,null,"HEXHAM","HEXHAM","NOR"]
[null,null,null,"HUDDERSFIELD","HUDDERSFIELD","NOR"]
[null,null,null,"THIRSK","THIRSK","NOR"]
[null,null,null,"HARROGATE","HARROGATE","NOR"]
[null,null,null,"HULL","HULL","NOR"]
[null,null,null,"DOUGLAS  IOM","DOUGLAS  IOM","NOR"]
[null,null,null,"PEEL","PEEL","NOR"]
[null,null,null,"RAMSEY  IOM","RAMSEY  IOM","NOR"]
[null,null,null,"RICHMOND YORKS","RICHMOND YORKS","NOR"]
[null,null,null,"KEIGHLEY","KEIGHLEY","NOR"]
[null,null,null,"ASHTON-UNDER-LYNE","ASHTON-UNDER-LYNE","NOR"]
[null,null,null,"LANCASTER","LANCASTER","NOR"]
[null,null,null,"KENDAL","KENDAL","NOR"]
[null,null,null,"LIVERPOOL","LIVERPOOL","NOR"]
[null,null,null,"ATHERTON","ATHERTON","NOR"]
[null,null,null,"LEASOWE","LEASOWE","NOR"]
[null,null,null,"MANCHESTER","MANCHESTER","NOR"]
[null,null,null,"DISLEY","DISLEY","NOR"]
[null,null,null,"MORECAMBE","MORECAMBE","NOR"]
[null,null,null,"STOCKPORT","STOCKPORT","NOR"]
[null,null,null,"BARNSLEY","BARNSLEY","NOR"]
[null,null,null,"NEWCASTLE UPON TYNE","NEWCASTLE UPON TYNE","NOR"]
[null,null,null,"SOUTHPORT","SOUTHPORT","NOR"]
[null,null,null,"ACCRINGTON","ACCRINGTON","NOR"]
[null,null,null,"PRESTON","PRESTON","NOR"]
[null,null,null,"PRESCO","PRESCO","NOR"]
[null,null,null,"DUKINFIELD","DUKINFIELD","NOR"]
[null,null,null,"HASLINGDEN","HASLINGDEN","NOR"]
[null,null,null,"RICHMOND NORTH YORKSHIRE","RICHMOND NORTH YORKSHIRE","NOR"]
[null,null,null,"NORTHWICH","NORTHWICH","NOR"]
[null,null,null,"WITHERNSEA","WITHERNSEA","NOR"]
[null,null,null,"SHIPLEY","SHIPLEY","NOR"]
[null,null,null,"SUNDERLAND","SUNDERLAND","NOR"]
[null,null,null,"GATESHEAD","GATESHEAD","NOR"]
[null,null,null,"OTLEY","OTLEY","NOR"]
[null,null,null,"LEEDS","LEEDS","NOR"]
[null,null,null,"WHITEHAVEN","WHITEHAVEN","NOR"]
[null,null,null,"DENTON","DENTON","NOR"]
[null,null,null,"FILEY","FILEY","NOR"]
[null,null,null,"CLECKHEATON","CLECKHEATON","NOR"]
[null,null,null,"HEBBURN","HEBBURN","NOR"]
[null,null,null,"BRADFORD","BRADFORD","NOR"]
[null,null,null,"ALLENDALE","ALLENDALE","NOR"]
[null,null,null,"RAMSEY IOM","RAMSEY IOM","NOR"]
[null,null,null,"WAKEFIELD ","WAKEFIELD ","NOR"]
[null,null,null,"DOUGLAS","DOUGLAS","NOR"]
[null,null,null,"DONCASTER","DONCASTER","NOR"]
[null,null,null,"NELSON","NELSON","NOR"]
[null,null,null,"CLEVELEYS","CLEVELEYS","NOR"]
[null,null,null,"FRECKLETON","FRECKLETON","NOR"]
[null,null,null,"WASHINGTON","WASHINGTON","NOR"]
[null,null,null,"LEIGH","LEIGH","NOR"]
[null,null,null,"HEPTONSTALL","HEPTONSTALL","NOR"]
[null,null,null,"SOUTH CAVE","SOUTH CAVE","NOR"]
[null,null,null,"HORWICH","HORWICH","NOR"]
[null,null,null,"KIRKBY LONSDALE","KIRKBY LONSDALE","NOR"]
[null,null,null,"LEYLAND","LEYLAND","NOR"]
[null,null,null,"HEYSHAM","HEYSHAM","NOR"]
[null,null,null,"BURY","BURY","NOR"]
[null,null,null,"ELLINGTON  MORPETH","ELLINGTON  MORPETH","NOR"]
[null,null,null,"DURHAM","DURHAM","NOR"]
[null,null,null,"LONGRIDGE","LONGRIDGE","NOR"]
[null,null,null,"NESTON","NESTON","NOR"]
[null,null,null,"BLACKBURN","BLACKBURN","NOR"]
[null,null,null,"WHITBY","WHITBY","NOR"]
[null,null,null,"COTTINGHAM","COTTINGHAM","NOR"]
[null,null,null,"ASTLEY","ASTLEY","NOR"]
[null,null,null,"TARVIN","TARVIN","NOR"]
[null,null,null,"FELLING","FELLING","NOR"]
[null,null,null,"ABERDEEN","ABERDEEN","SCO"]
[null,null,null,"ARISAIG","ARISAIG","SCO"]
[null,null,null,"HAWICK","HAWICK","SCO"]
[null,null,null,"ANGUS","ANGUS","SCO"]
[null,null,null,"LANGHOLM","LANGHOLM","SCO"]
[null,null,null,"DALRY","DALRY","SCO"]
[null,null,null,"DUNS","DUNS","SCO"]
[null,null,null,"MUIR OF ORD","MUIR OF ORD","SCO"]
[null,null,null,"BERWICK ON TWEED","BERWICK ON TWEED","SCO"]
[null,null,null,"MOTHERWELL","MOTHERWELL","SCO"]
[null,null,null,"DUNDEE","DUNDEE","SCO"]
[null,null,null,"NEWTON STEWART","NEWTON STEWART","SCO"]
[null,null,null,"PETERHEAD","PETERHEAD","SCO"]
[null,null,null,"DUMBARTON","DUMBARTON","SCO"]
[null,null,null,"DUNS ","DUNS ","SCO"]
[null,null,null,"EDINBURGH","EDINBURGH","SCO"]
[null,null,null,"LOCHMADDY","LOCHMADDY","SCO"]
[null,null,null,"STIRLING","STIRLING","SCO"]
[null,null,null,"UPPER LARGO","UPPER LARGO","SCO"]
[null,null,null,"GLASGOW","GLASGOW","SCO"]
[null,null,null,"BANCHORY","BANCHORY","SCO"]
[null,null,null,"ISLE OF MULL","ISLE OF MULL","SCO"]
[null,null,null,"SELKIRK","SELKIRK","SCO"]
[null,null,null,"LESLIE","LESLIE","SCO"]
[null,null,null,"STORNOWAY","STORNOWAY","SCO"]
[null,null,null,"ISLE OF SOUTH UIST","ISLE OF SOUTH UIST","SCO"]
[null,null,null,"KILSYTH","KILSYTH","SCO"]
[null,null,null,"SANQUHAR","SANQUHAR","SCO"]
[null,null,null,"LAUDER","LAUDER","SCO"]
[null,null,null,"LERWICK","LERWICK","SCO"]
[null,null,null,"FRASERBURGH","FRASERBURGH","SCO"]
[null,null,null,"KIRKWALL","KIRKWALL","SCO"]
[null,null,null,"LINLITHGOW","LINLITHGOW","SCO"]
[null,null,null,"PAISLEY","PAISLEY","SCO"]
[null,null,null,"PERTH","PERTH","SCO"]
[null,null,null,"ELGIN MORAY","ELGIN MORAY","SCO"]
[null,null,null,"LARGS","LARGS","SCO"]
[null,null,null,"FORFAR","FORFAR","SCO"]
[null,null,null,"KILMARNOCK","KILMARNOCK","SCO"]
[null,null,null,"BANFF","BANFF","SCO"]
[null,null,null,"BATHGATE","BATHGATE","SCO"]
[null,null,null,"KIRRIEMUIR","KIRRIEMUIR","SCO"]
[null,null,null,"AIRDRIE","AIRDRIE","SCO"]
[null,null,null,"DUNBAR","DUNBAR","SCO"]
[null,null,null,"KENNOWAY  FIFE","KENNOWAY  FIFE","SCO"]
[null,null,null,"PORTPATRICK","PORTPATRICK","SCO"]
[null,null,null,"STRANRAER","STRANRAER","SCO"]
[null,null,null,"MONIFIETH","MONIFIETH","SCO"]
[null,null,null,"ERSKINE","ERSKINE","SCO"]
[null,null,null,"LADYBANK","LADYBANK","SCO"]
[null,null,null,"PRESTONPANS","PRESTONPANS","SCO"]
[null,null,null,"GALASHIELS","GALASHIELS","SCO"]
[null,null,null,"KEITH","KEITH","SCO"]
[null,null,null,"DUMFRIES","DUMFRIES","SCO"]
[null,null,null,"PRESTONPANS ","PRESTONPANS ","SCO"]
[null,null,null,"INVERNESS","INVERNESS","SCO"]
[null,null,null,"JEDBURGH","JEDBURGH","SCO"]
[null,null,null,"KIRKCALDY","KIRKCALDY","SCO"]
[null,null,null,"ALEXANDRIA","ALEXANDRIA","SCO"]
[null,null,null,"GALASHIELS ","GALASHIELS ","SCO"]
[null,null,null,"LIVINGSTON","LIVINGSTON","SCO"]
[null,null,null,"MAYBOLE","MAYBOLE","SCO"]
[null,null,null,"NAIRN","NAIRN","SCO"]
[null,null,null,"ST MONANS","ST MONANS","SCO"]
[null,null,null,"DALKEITH","DALKEITH","SCO"]
[null,null,null,"LOSSIEMOUTH","LOSSIEMOUTH","SCO"]
[null,null,null,"GLENROTHES ","GLENROTHES ","SCO"]
[null,null,null,"EPSOM","EPSOM","SE"]
[null,null,null,"SURREY","SURREY","SE"]
[null,null,null,"LEWES","LEWES","SE"]
[null,null,null,"CHESHAM","CHESHAM","SE"]
[null,null,null,"AMERSHAM","AMERSHAM","SE"]
[null,null,null,"AYLESBURY","AYLESBURY","SE"]
[null,null,null,"BEDFORD","BEDFORD","SE"]
[null,null,null,"BEXHILL-ON-SEA","BEXHILL-ON-SEA","SE"]
[null,null,null,"BROMLEY","BROMLEY","SE"]
[null,null,null,"HEMEL HEMPSTEAD ","HEMEL HEMPSTEAD ","SE"]
[null,null,null,"HOVE","HOVE","SE"]
[null,null,null,"HEMEL HEMPSTEAD","HEMEL HEMPSTEAD","SE"]
[null,null,null,"CHICHESTER","CHICHESTER","SE"]
[null,null,null,"CHARING KENT","CHARING KENT","SE"]
[null,null,null,"WORTHING","WORTHING","SE"]
[null,null,null,"NEWHAVEN","NEWHAVEN","SE"]
[null,null,null,"MARGATE","MARGATE","SE"]
[null,null,null,"HASTINGS","HASTINGS","SE"]
[null,null,null,"FOLKESTONE","FOLKESTONE","SE"]
[null,null,null,"HORSHAM","HORSHAM","SE"]
[null,null,null,"HARROW","HARROW","SE"]
[null,null,null,"GIDEA PARK","GIDEA PARK","SE"]
[null,null,null,"HAYWARDS HEATH","HAYWARDS HEATH","SE"]
[null,null,null,"ROCHESTER","ROCHESTER","SE"]
[null,null,null,"ERITH","ERITH","SE"]
[null,null,null,"CHATHAM ","CHATHAM ","SE"]
[null,null,null,"HERNE BAY","HERNE BAY","SE"]
[null,null,null,"MAIDSTONE","MAIDSTONE","SE"]
[null,null,null,"DOVER","DOVER","SE"]
[null,null,null,"LONDON","LONDON","SE"]
[null,null,null,"LUTON","LUTON","SE"]
[null,null,null,"NORTH LONDON","NORTH LONDON","SE"]
[null,null,null,"EAST GRINSTEAD","EAST GRINSTEAD","SE"]
[null,null,null,"MILTON KEYNES","MILTON KEYNES","SE"]
[null,null,null,"STAINES UPON THAMES","STAINES UPON THAMES","SE"]
[null,null,null,"BANSTEAD","BANSTEAD","SE"]
[null,null,null,"BUCKHURST HILL","BUCKHURST HILL","SE"]
[null,null,null,"ROYSTON","ROYSTON","SE"]
[null,null,null,"BARKWAY","BARKWAY","SE"]
[null,null,null,"CAMBRIDGE","CAMBRIDGE","SE"]
[null,null,null,"RUSTINGTON","RUSTINGTON","SE"]
[null,null,null,"CANTERBURY","CANTERBURY","SE"]
[null,null,null,"TRING","TRING","SE"]
[null,null,null,"BRILL","BRILL","SE"]
[null,null,null,"WELWYN GARDEN CITY","WELWYN GARDEN CITY","SE"]
[null,null,null,"HARPENDEN","HARPENDEN","SE"]
[null,null,null,"STEVENAGE OLD TOWN","STEVENAGE OLD TOWN","SE"]
[null,null,null,"MORDEN","MORDEN","SE"]
[null,null,null,"EASTBOURNE","EASTBOURNE","SE"]
[null,null,null,"NEW ASH GREEN","NEW ASH GREEN","SE"]
[null,null,null,"ASHFORD","ASHFORD","SE"]
[null,null,null,"BRIGHTON","BRIGHTON","SE"]
[null,null,null,"WOBURN SANDS","WOBURN SANDS","SE"]
[null,null,null,"NEW ROMNEY","NEW ROMNEY","SE"]
[null,null,null,"SOUTHEND ON SEA","SOUTHEND ON SEA","SE"]
[null,null,null,"CHATHAM","CHATHAM","SE"]
[null,null,null,"HIGH WYCOMBE","HIGH WYCOMBE","SE"]
[null,null,null,"ROMFORD","ROMFORD","SE"]
[null,null,null,"HEATHROW","HEATHROW","SE"]
[null,null,null,"WESTCLIFF ON SEA","WESTCLIFF ON SEA","SE"]
[null,null,null,"LEIGHTON BUZZARD","LEIGHTON BUZZARD","SE"]
[null,null,null,"HEATHFIELD","HEATHFIELD","SE"]
[null,null,null,"HAILSHAM","HAILSHAM","SE"]
[null,null,null,"BECKENHAM","BECKENHAM","SE"]
[null,null,null,"BANSTEAD  SURREY","BANSTEAD  SURREY","SE"]
[null,null,null,"THURROCK","THURROCK","SE"]
[null,null,null,"HITCHIN","HITCHIN","SE"]
[null,null,null,"BILLINGSHURST","BILLINGSHURST","SE"]
[null,null,null,"WESTON SUPER MARE","WESTON SUPER MARE","SW"]
[null,null,null,"GOSPORT","GOSPORT","SW"]
[null,null,null,"SHIPHAM","SHIPHAM","SW"]
[null,null,null,"BRISTOL","BRISTOL","SW"]
[null,null,null,"NEWBURY","NEWBURY","SW"]
[null,null,null,"BASINGSTOKE","BASINGSTOKE","SW"]
[null,null,null,"BANBURY","BANBURY","SW"]
[null,null,null,"CHULMLEIGH","CHULMLEIGH","SW"]
[null,null,null,"BRACKNELL","BRACKNELL","SW"]
[null,null,null,"BUDE","BUDE","SW"]
[null,null,null,"GLOUCESTER","GLOUCESTER","SW"]
[null,null,null,"LISKEARD","LISKEARD","SW"]
[null,null,null,"FAREHAM","FAREHAM","SW"]
[null,null,null,"DIDCOT","DIDCOT","SW"]
[null,null,null,"STIBB CROSS","STIBB CROSS","SW"]
[null,null,null,"POLPERRO","POLPERRO","SW"]
[null,null,null,"WEYMOUTH","WEYMOUTH","SW"]
[null,null,null,"BLANDFORD","BLANDFORD","SW"]
[null,null,null,"ILMINSTER","ILMINSTER","SW"]
[null,null,null,"EXETER","EXETER","SW"]
[null,null,null,"SILVERTON","SILVERTON","SW"]
[null,null,null,"SOMERSET","SOMERSET","SW"]
[null,null,null,"CHEDDAR","CHEDDAR","SW"]
[null,null,null,"FARNHAM","FARNHAM","SW"]
[null,null,null,"NORTHLEACH","NORTHLEACH","SW"]
[null,null,null,"GUILDFORD","GUILDFORD","SW"]
[null,null,null,"ST HELIER","ST HELIER","SW"]
[null,null,null,"GUERNSEY","GUERNSEY","SW"]
[null,null,null,"ROCHE","ROCHE","SW"]
[null,null,null,"LONG ASHTON  BRISTOL","LONG ASHTON  BRISTOL","SW"]
[null,null,null,"NEWPORT","NEWPORT","SW"]
[null,null,null,"MERE WILTSHIRE","MERE WILTSHIRE","SW"]
[null,null,null,"TIVERTON","TIVERTON","SW"]
[null,null,null,"EASTLEIGH","EASTLEIGH","SW"]
[null,null,null,"WINKLEIGH","WINKLEIGH","SW"]
[null,null,null,"NEAR HOLSWORTHY","NEAR HOLSWORTHY","SW"]
[null,null,null,"PORTSMOUTH","PORTSMOUTH","SW"]
[null,null,null,"WIMBORNE","WIMBORNE","SW"]
[null,null,null,"FARNBOROUGH","FARNBOROUGH","SW"]
[null,null,null,"PLYMPTON","PLYMPTON","SW"]
[null,null,null,"CHELTENHAM","CHELTENHAM","SW"]
[null,null,null,"READING","READING","SW"]
[null,null,null,"AXMINSTER","AXMINSTER","SW"]
[null,null,null,"STROUD","STROUD","SW"]
[null,null,null,"SOUTHAMPTON","SOUTHAMPTON","SW"]
[null,null,null,"HELSTON","HELSTON","SW"]
[null,null,null,"ALTON HANTS","ALTON HANTS","SW"]
[null,null,null,"SIDMOUTH","SIDMOUTH","SW"]
[null,null,null,"SWINDON","SWINDON","SW"]
[null,null,null,"TORQUAY","TORQUAY","SW"]
[null,null,null,"BATH AVON","BATH AVON","SW"]
[null,null,null,"TRULL","TRULL","SW"]
[null,null,null,"WESTON-SUPER-MARE","WESTON-SUPER-MARE","SW"]
[null,null,null,"IVYBRIDGE","IVYBRIDGE","SW"]
[null,null,null,"CLANFIELD","CLANFIELD","SW"]
[null,null,null,"MILTON ABBAS","MILTON ABBAS","SW"]
[null,null,null,"SLOUGH","SLOUGH","SW"]
[null,null,null,"WINCHESTER","WINCHESTER","SW"]
[null,null,null,"POOLE","POOLE","SW"]
[null,null,null,"BIDEFORD","BIDEFORD","SW"]
[null,null,null,"AXBRIDGE","AXBRIDGE","SW"]
[null,null,null,"BARNHAM","BARNHAM","SW"]
[null,null,null,"CHURCHDOWN","CHURCHDOWN","SW"]
[null,null,null,"ST. PETER PORT","ST. PETER PORT","SW"]
[null,null,null,"TAVISTOCK","TAVISTOCK","SW"]
[null,null,null,"NEWTON ABBOT","NEWTON ABBOT","SW"]
[null,null,null,"PLYMOUTH","PLYMOUTH","SW"]
[null,null,null,"LIVERTON","LIVERTON","SW"]
[null,null,null,"MERE  WILTSHIRE","MERE  WILTSHIRE","SW"]
[null,null,null,"WINCANTON","WINCANTON","SW"]
[null,null,null,"ANDOVER","ANDOVER","SW"]
[null,null,null,"LODDISWELL","LODDISWELL","SW"]
[null,null,null,"ST AUSTELL","ST AUSTELL","SW"]
[null,null,null,"BLANDFORD FORUM","BLANDFORD FORUM","SW"]
[null,null,null,"ROMSEY","ROMSEY","SW"]
[null,null,null,"ALDERSHOT","ALDERSHOT","SW"]
[null,null,null,"NEAR HOLSWORTHY ","NEAR HOLSWORTHY ","SW"]
[null,null,null,"MULLION","MULLION","SW"]
[null,null,null,"PRINCETOWN","PRINCETOWN","SW"]
[null,null,null,"CHARTERHOUSE","CHARTERHOUSE","SW"]
[null,null,null,"YELVERTON","YELVERTON","SW"]
[null,null,null,"SUNNINGDALE","SUNNINGDALE","SW"]
[null,null,null,"SALISBURY","SALISBURY","SW"]
[null,null,null,"CHIPPENHAM","CHIPPENHAM","SW"]
[null,null,null,"WEMBWORTHY","WEMBWORTHY","SW"]
[null,null,null,"WOKING","WOKING","SW"]
[null,null,null,"KINGTON LANGLEY","KINGTON LANGLEY","SW"]
[null,null,null,"AMLWCH","AMLWCH","WM"]
[null,null,null,"CAERNARFON","CAERNARFON","WM"]
[null,null,null,"BRECON","BRECON","WM"]
[null,null,null,"PONTYPRIDD","PONTYPRIDD","WM"]
[null,null,null,"CARMARTHEN","CARMARTHEN","WM"]
[null,null,null,"NEWCASTLE EMLYN","NEWCASTLE EMLYN","WM"]
[null,null,null,"CAERGWRLE","CAERGWRLE","WM"]
[null,null,null,"LLANDUDNO","LLANDUDNO","WM"]
[null,null,null,"LLANGOLLEN","LLANGOLLEN","WM"]
[null,null,null,"MERTHYR","MERTHYR","WM"]
[null,null,null,"LLANFAIR CAEREINION","LLANFAIR CAEREINION","WM"]
[null,null,null,"PRESTATYN","PRESTATYN","WM"]
[null,null,null,"PWLLHELI","PWLLHELI","WM"]
[null,null,null,"NEWTOWN","NEWTOWN","WM"]
[null,null,null,"LLANDRINDOD WELLS","LLANDRINDOD WELLS","WM"]
[null,null,null,"SWANSEA","SWANSEA","WM"]
[null,null,null,"PEMBROKE","PEMBROKE","WM"]
[null,null,null,"TONDU  BRIDGEND","TONDU  BRIDGEND","WM"]
[null,null,null,"WREXHAM","WREXHAM","WM"]
[null,null,null,"FISHGUARD","FISHGUARD","WM"]
[null,null,null,"PORT TALBOT","PORT TALBOT","WM"]
[null,null,null,"CWMBRAN","CWMBRAN","WM"]
[null,null,null,"NEWTOWN POWYS","NEWTOWN POWYS","WM"]
[null,null,null,"CARDIFF","CARDIFF","WM"]
[null,null,null,"TREFFGARNE","TREFFGARNE","WM"]
[null,null,null,"COWBRIDGE","COWBRIDGE","WM"]

{"sheet":"Help","index":3,"n_rows":24,"n_cols":13,"rows_kept":24,"cut":false,"hidden":false,"merged":[[20,11,22,11],[4,12,6,14],[9,12,11,14],[14,12,16,14],[20,12,20,15],[22,12,22,15],[19,12,19,15],[21,12,21,15],[18,12,18,16],[23,1,23,10],[20,1,20,10],[21,1,21,10],[22,1,22,10],[1,1,2,6],[4,1,7,10],[9,1,14,10],[16,1,18,10]]}
[]
[null,"email: alex@rocketwaveuk.com"]
[]
[]
[null,"This Spreadsheet is provided with no guarantee or any right to compensation in anyway shape or form. And is provided as a gift for you to use at your own risk, every effort has been made to ensure this database is up to date. And its main table is downloaded from the UKRepeaters webpage. ",null,null,null,null,null,null,null,null,null,null,"Offsets  : Red Cells are Minus Green Are Positive"]
[]
[]
[]
[]
[null,"Select first the Area from the drop down list, then the Town from its list, this will show all Repeters in the town for you, or at the bottom of the town list select the Blank town to show All Towns and Repeaters. The other Area selection list is OUTPUT when this is selected  it shows in the Output list of all frequencies  to choose from, or just type the one you wish to view ie 145.725 or 433.050 this will then display all repeaters only on this frequency. ",null,null,null,null,null,null,null,null,null,null,"Status :  Green Working , Red Not working and Pink Reduced output."]
[]
[]
[]
[]
[null,null,null,null,null,null,null,null,null,null,null,null,"CTCSS/DMR: DMR Light Blue and CTCSS are Violet"]
[]
[null,"Should you find over time the Town Selection list is outdated you can update this in the Temp sheet.  Its all automated and refreshes from the Data sheet of towns. And when done ( It`s Fast ) it will return you to  the main Rptrs sheet again."]
[]
[]
[null,null,null,null,null,null,null,null,null,null,null,null,"Link To RSGB Site Below"]
[null,"To Update This Data  You Must Open All 3 Workbooks At The Same Time",null,null,null,null,null,null,null,null,null,"→","https://ukrepeater.net/csvfiles.html"]
[null,"This workbook -- The New repeaterlist-alt2.csv downloaded workbook -- And Prepared Repeaterlist.xlsm",null,null,null,null,null,null,null,null,null,null,"Auto Download CSV Workbook Below"]
[null,"once you have all 3 workbooks open select - Prepared Repeaterlist.xlsm and run the macro.",null,null,null,null,null,null,null,null,null,null,"https://ukrepeater.net/repeaterlist-alt.php"]
[null,"Then After Return To This Workbook And On The Temp Sheet Run The Update Macro"]